program: Gaussian 09
title: 000044336
version: EM64L-G09RevD.01
frameworkgroup: C1[X(C15H14Cl2)]
method: RPBEPBE
basis: SDD
operation: Freq
keyword: #p
keyword: freq=noraman
keyword: PBEPBE/SDD
title: #p freq=noraman PBEPBE/SDD
converged: YES YES NO NO
title: Mulliken charges:
elementType: Cl Cl C C C C C C C C C C C C C C C H H H H H H H H H H H H H H
charge: -0.040504 -0.056267 -0.237765 0.552929 0.335507 -0.690764 -0.691496 -0.402061 -0.469132 -0.392281 -0.395414 0.474714 -0.368919 -0.352671 -0.112996 -0.205458 -0.232624 0.209546 0.212010 0.213212 0.228788 0.227624 0.214000 0.211109 0.231298 0.234423 0.253070 0.245655 0.280770 0.260400 0.263297
chargesum: 0.00000
title: Mulliken charges with hydrogens summed into heavy atoms:
elementType: Cl Cl C C C C C C C C C C C C C C C
charge: -0.040504 -0.056267 -0.028219 0.552929 0.335507 -0.036755 -0.038763 -0.170763 -0.234709 -0.139211 -0.149759 0.474714 -0.368919 -0.071901 -0.112996 0.054942 0.030673
polarizability: 2.77403128e+02 -7.31184764e+00 1.78401381e+02 7.78873969e-02 1.17239794e+01 1.05083524e+02
1716.lowfreq: -18.7710 -7.4785 -0.0037 -0.0034 -0.0020 7.5930 9.5313 42.9812 57.7005
frequency: -11.7005 42.9697 57.6624 75.8020 93.6577 116.7948 156.9638 192.4702 210.5349 232.4585 245.0800 253.8891 278.9943 308.6263 318.1077 339.5539 366.4597 407.9850 441.9936 457.2785 486.5919 521.5345 565.4543 578.3429 589.7776 634.5940 662.1322 714.0210 731.1521 754.6385 799.6800 807.6204 843.2210 848.2856 888.2716 891.2514 919.1923 942.3789 953.4206 959.3310 974.4895 992.4739 1014.1912 1046.4028 1062.1977 1086.0872 1110.8280 1119.1389 1131.7817 1156.5473 1200.0447 1223.3917 1244.4456 1274.0916 1296.1237 1306.0428 1318.2746 1349.9916 1375.1862 1379.0722 1387.8124 1398.1190 1412.2459 1447.7716 1466.8346 1467.9235 1479.9714 1485.0329 1511.6390 1551.2045 1573.1538 1594.7801 1620.3396 2975.3623 2978.0046 2980.5971 3068.1028 3075.1168 3078.7828 3083.0935 3117.1155 3125.7932 3141.3919 3159.4913 3163.5437 3167.1772 3183.8582
redmass: 3.0433 5.0000 4.0184 4.8224 9.9472 4.1655 6.5167 3.7315 1.1885 3.0743 1.1986 4.7911 4.7087 15.4194 5.0229 3.3828 4.0503 2.8666 4.3970 3.2487 3.4312 5.3282 4.4656 3.7598 2.9665 6.8957 5.6533 4.0688 4.7914 3.6858 6.0738 1.3444 1.5102 1.3011 1.8396 1.8995 1.1765 1.3416 1.4646 1.3663 1.3799 7.3543 3.2311 2.1489 2.5748 1.8806 2.5652 1.5378 1.4142 1.7132 1.1182 1.8955 1.5311 2.1346 1.6286 1.3191 1.9259 3.5076 3.2489 1.1945 4.2993 1.2276 2.7776 2.5649 1.0476 1.0474 1.0505 1.0902 2.6607 6.4479 6.6760 8.2922 6.3505 1.0349 1.0357 1.0841 1.1000 1.0992 1.1004 1.0997 1.0872 1.0883 1.0962 1.0956 1.0890 1.0921 1.0978
irintensity: 0.0314 0.2541 0.1141 0.7871 0.2001 0.0108 0.4662 0.4974 0.0569 0.1097 0.0625 0.8447 0.4727 0.1667 0.5634 0.4371 0.0336 0.5358 7.4776 13.0383 3.2967 10.8706 13.8343 6.1049 33.9106 0.1566 0.9205 0.3632 6.7396 0.3112 17.5109 39.8849 43.0814 8.1190 4.0174 9.3957 3.1200 0.1861 0.0489 0.4132 2.1023 68.4252 34.0924 31.1655 10.0037 33.3553 1.1421 9.1912 6.4669 0.2315 2.1151 2.8179 1.3882 7.6004 9.2040 0.6719 9.3034 8.1056 6.7307 15.4988 6.4446 9.5371 8.1535 101.2394 0.1124 5.8908 15.0733 13.4648 16.9218 14.6232 1.1902 28.1948 10.5830 30.4365 40.1223 18.7355 0.4016 107.3362 24.3718 40.1470 15.4664 21.1116 17.2022 5.4247 0.8890 0.4633 1.5174
temp: 298.150 k
press: 1.00000 atm
elementType: 17 17 6 6 6 6 6 6 6 6 6 6 6 6 6 6 6 1 1 1 1 1 1 1 1 1 1 1 1 1 1
symmnumber: 1
zpe: 634279.4 jmol-1
zpe.correction: 0.241584 hartree
zpe.thermalcorrener: 0.256941 hartree
zpe.thermalcorrenthalpy: 0.257885 hartree
zpe.thermalcorrgfe: 0.198287 hartree
zpe.sumelectzpe: -1498.912516 hartree
zpe.sumelectthermal: -1498.897158 hartree
zpe.sumelectthermalent: -1498.896214 hartree
zpe.sumelectthermalfe: -1498.955813 hartree
dipole: -1.4997 -0.0584 0.0670
dipole: 1.5023
quadrupole: -102.9410 -115.6138 -115.1363
quadrupole: 8.6956 -0.1994 4.5979
quadrupole: 8.2893 -4.3834 -3.9059 8.6956 -0.1994 4.5979
hfenergy: -1499.1540998 hartree
pointgroup: C01 [X(C15H14Cl2)]
dipole: 0.5892584 -0.0062592 -0.0457844 debye
polarizability: 275.905662|9.9264189|152.7608988|-9.9588685|-37.8560899|132.2214723 unknown
InChI: InChI=1S/C15H14Cl2/c1-10(2)11-3-5-12(6-4-11)14-9-13(16)7-8-15(14)17/h3-10H,1-2H3
charge 0 multiplicity 1
31 atoms
Cl -1.339902 2.695165 -1.273191
Cl -4.590091 -2.261825 1.214341
C  4.390167 -0.38444 0.280235
C  2.869252 -0.236932 0.192874
C  0.013855 0.051586 0.037781
C  5.109011 0.962017 -0.002872
C  4.910129 -1.497828 -0.668464
C  2.2331 0.141521 -1.019149
C  2.047337 -0.472951 1.322794
C  0.834466 0.28586 -1.098545
C  0.644726 -0.336619 1.248725
C  -1.474244 0.148504 -0.02687
C  -2.199044 1.227744 -0.601136
C  -2.248995 -0.91165 0.529398
C  -3.651766 -0.873583 0.494595
C  -3.607504 1.260869 -0.63776
C  -4.355202 0.197609 -0.087553
H  4.637218 -0.685467 1.318442
H  4.906361 1.311194 -1.032475
H  6.203604 0.847755 0.105778
H  4.770845 1.750303 0.693328
H  4.423339 -2.466144 -0.454066
H  6.00274 -1.624901 -0.554634
H  4.70875 -1.244947 -1.726171
H  2.836695 0.323038 -1.916388
H  2.511259 -0.761191 2.274105
H  0.373189 0.567879 -2.049992
H  0.035594 -0.504577 2.144718
H  -1.731941 -1.77376 0.960203
H  -4.119947 2.117887 -1.083493
H  -5.447902 0.211681 -0.11076
