program: Gaussian 09
title: 000044323
version: EM64L-G09RevD.01
frameworkgroup: C1[X(C16H31NO)]
method: RPBEPBE
basis: SDD
operation: Freq
keyword: #p
keyword: freq=noraman
keyword: PBEPBE/SDD
title: #p freq=noraman PBEPBE/SDD
converged: YES YES NO NO
title: Mulliken charges:
elementType: O N C C C C C C C C C C C C C C C C H H H H H H H H H H H H H H H H H H H H H H H H H H H H H H H
charge: -0.235099 -0.112376 -0.386146 -0.420792 -0.384603 -0.385453 -0.386206 -0.373133 -0.374123 -0.385589 -0.500691 0.142444 -0.384930 -0.381792 -0.372911 -0.353215 -0.356791 -0.696731 0.243578 0.253170 0.237666 0.241363 0.191945 0.193768 0.193620 0.198121 0.194819 0.193461 0.190599 0.190306 0.193361 0.192849 0.198387 0.236049 0.238963 0.219698 0.192900 0.193317 0.191544 0.191668 0.189480 0.189225 0.187516 0.187331 0.194597 0.194932 0.209692 0.209379 0.214832
chargesum: 0.00000
title: Mulliken charges with hydrogens summed into heavy atoms:
elementType: O N C C C C C C C C C C C C C C C C
charge: -0.235099 -0.112376 0.110602 0.058237 0.001110 0.006288 0.002075 0.007771 0.060313 0.000621 -0.042030 0.142444 0.001287 0.001420 0.005794 0.021632 0.032738 -0.062828
polarizability: 2.50536255e+02 4.62690243e+00 1.62800534e+02 -4.79799525e+00 7.58433310e-01 1.44110066e+02
1716.lowfreq: -30.9753 -3.5969 -0.0018 -0.0007 0.0017 3.9507 7.0399 11.7208 21.4144
frequency: -20.8588 8.4614 21.1743 25.3328 26.8643 51.8457 56.1159 65.3853 85.4054 96.9681 107.2558 112.4836 123.5304 127.4640 131.7282 144.7632 149.9406 160.7723 186.6718 215.5371 225.7984 251.8768 290.7999 333.4209 390.6899 406.2639 450.8128 484.8427 497.4089 569.4570 582.0023 716.8983 717.8796 720.5419 727.2339 741.4674 743.2838 768.1909 800.5912 803.4494 846.1208 886.7856 892.7385 906.3053 936.4203 944.9297 978.2776 985.7408 989.6223 1000.3616 1009.0916 1027.3183 1030.6347 1039.9921 1062.9117 1072.6751 1078.1070 1079.4746 1081.9169 1082.6479 1087.5143 1097.0212 1109.5888 1116.4817 1122.9787 1135.4589 1141.9281 1179.4966 1195.8184 1199.2903 1218.5874 1225.1170 1241.3410 1248.4880 1261.9830 1269.6707 1275.6452 1279.4109 1280.4429 1286.0295 1288.4450 1292.8930 1293.4949 1297.4142 1316.4357 1334.3833 1347.0437 1352.6481 1354.1402 1355.9944 1357.5413 1386.8796 1391.2699 1444.3832 1458.8711 1458.9723 1461.8517 1462.0353 1463.8226 1464.2885 1466.3228 1470.7132 1475.3379 1475.8176 1480.1892 1481.4611 1484.3359 1487.4234 1488.8934 1596.6445 2947.2013 2947.6052 2948.4103 2949.4536 2950.6998 2951.6670 2955.4453 2959.9725 2964.1006 2967.8268 2970.9313 2971.3221 2980.4406 2981.1167 2983.0449 2986.3000 2990.7012 2996.7059 3005.6070 3015.6875 3024.7090 3028.3251 3035.3090 3041.9105 3059.1912 3067.4006 3067.8965 3069.5721 3081.5978 3171.5119 3190.8914
redmass: 2.0851 4.0486 3.5079 2.6439 2.5396 2.6639 3.4028 2.0801 2.3325 2.1780 2.4977 3.1673 2.8910 2.2985 2.7498 2.0905 2.0542 3.2968 3.1364 3.2156 1.1282 4.0844 3.7448 3.5114 3.8592 3.2138 3.2130 3.1599 2.9875 4.7613 2.9256 1.0577 1.0642 1.0785 1.1067 1.5111 2.5008 1.1888 1.0485 1.2454 1.2743 1.8799 1.4256 3.2944 3.0407 1.3466 5.2878 4.1137 1.1999 1.1793 3.8573 1.1066 3.2295 3.5374 2.9467 2.5448 1.7894 2.1181 2.1578 2.0437 2.5722 1.3429 1.3573 1.4395 2.8187 1.8360 1.7354 1.9105 1.5124 1.3573 1.4410 1.3389 1.3447 1.3255 1.2749 1.2690 1.0279 1.2183 1.0539 1.1010 1.1153 1.1217 1.1168 1.3031 1.3961 1.4590 1.5294 1.7137 1.6433 1.6515 1.6590 1.2175 4.3824 1.0879 1.0743 1.0742 1.0711 1.0712 1.0746 1.0644 1.0805 1.0839 1.0665 1.0611 1.0895 1.2407 1.0922 1.0948 1.0955 9.0352 1.0588 1.0585 1.0589 1.0588 1.0593 1.0595 1.0595 1.0591 1.0586 1.0585 1.0365 1.0631 1.0905 1.0785 1.0916 1.0942 1.0971 1.1006 1.1029 1.1039 1.1014 1.1009 1.1047 1.1045 1.1015 1.1006 1.0509 1.0993 1.0573 1.1184 1.1177
irintensity: 1.5358 0.4912 0.2010 0.9501 0.2441 0.5946 0.5111 0.1261 0.4263 0.1288 0.7107 3.3903 3.0751 0.0655 0.3776 0.1253 0.2921 2.0140 6.6653 3.3494 0.0758 7.0540 0.4581 2.9761 1.4135 1.2863 3.1585 0.8040 1.3218 10.4323 1.0549 20.5478 0.5018 7.0207 0.2717 0.9567 7.9647 0.3621 14.5691 0.8506 0.5925 4.2795 1.6721 1.3806 7.5126 0.2565 0.8619 2.9355 0.5047 2.2060 1.8988 1.2001 0.2830 3.8208 1.8489 14.1777 48.5997 1.3537 1.5220 4.4255 2.5671 2.9492 6.5907 14.4023 6.1402 33.7501 29.3205 0.0613 8.3565 29.0527 0.1187 3.3131 0.7021 4.6160 0.6047 2.2912 0.2078 0.4344 0.4811 1.4074 0.5476 0.1937 0.1078 1.2864 1.5337 3.1427 2.1846 0.8940 1.7814 0.4643 0.6007 11.3843 291.4043 12.8240 0.0023 0.0797 0.1291 0.0902 4.7407 0.3318 0.0570 1.3338 5.4030 7.2870 3.1410 24.0433 1.9546 4.7126 45.8969 232.1628 0.7899 0.2447 2.7051 1.0099 2.0511 0.4615 4.2141 0.1650 133.2617 210.2537 38.2720 1.3862 6.5741 31.8819 10.4404 8.3944 4.9081 2.5862 1.9360 1.1968 15.1577 0.6334 0.5387 281.1536 84.6274 98.1254 36.1407 56.3938 30.8437 5.7680 26.7937
temp: 298.150 k
press: 1.00000 atm
elementType: 8 7 6 6 6 6 6 6 6 6 6 6 6 6 6 6 6 6 1 1 1 1 1 1 1 1 1 1 1 1 1 1 1 1 1 1 1 1 1 1 1 1 1 1 1 1 1 1 1
symmnumber: 1
zpe: 1153065.4 jmol-1
zpe.correction: 0.439179 hartree
zpe.thermalcorrener: 0.461797 hartree
zpe.thermalcorrenthalpy: 0.462741 hartree
zpe.thermalcorrgfe: 0.381838 hartree
zpe.sumelectzpe: -756.755090 hartree
zpe.sumelectthermal: -756.732472 hartree
zpe.sumelectthermalent: -756.731528 hartree
zpe.sumelectthermalfe: -756.812431 hartree
dipole: -0.4317 -3.3973 1.3945
dipole: 3.6977
quadrupole: -105.5885 -119.4407 -112.8634
quadrupole: 23.8277 -11.0438 -1.1376
quadrupole: 7.0423 -6.8098 -0.2325 23.8277 -11.0438 -1.1376
hfenergy: -757.1942689 hartree
pointgroup: C01 [X(C16H31N1O1)]
dipole: -0.1914736 0.713948 -1.2529928 debye
polarizability: 250.7346846|-0.827628|156.4303013|4.9083755|-8.8778623|150.2818695 unknown
InChI: InChI=1S/C16H31NO/c1-2-3-4-5-6-7-8-9-10-11-12-13-16(18)17-14-15-17/h2-15H2,1H3
charge 0 multiplicity 1
49 atoms
O  -6.25713 -1.207241 1.4560
N  -7.399097 0.380364 0.190442
C  -8.61316 -0.313835 -0.269066
C  -7.831463 0.629699 -1.20527
C  0.192404 0.502646 0.16641
C  -1.114545 -0.319763 0.224926
C  1.464583 -0.372558 0.105941
C  -2.385925 0.556329 0.28882
C  -3.686223 -0.272136 0.374795
C  2.772098 0.449762 0.057533
C  -4.949731 0.614314 0.426205
C  -6.224163 -0.182754 0.715185
C  4.045062 -0.4247 0.00279
C  5.352526 0.39819 -0.038549
C  6.626188 -0.475766 -0.088973
C  7.933741 0.34734 -0.124333
C  9.207627 -0.527127 -0.174344
C  10.508816 0.303755 -0.206322
H  -9.559096 0.024715 0.165456
H  -8.535273 -1.394293 -0.439353
H  -7.250031 0.16922 -2.014377
H  -8.230148 1.626065 -1.424134
H  0.166076 1.17224 -0.7190
H  0.246858 1.165859 1.055223
H  -1.169918 -0.98396 -0.662971
H  -1.087976 -0.98814 1.110543
H  1.487729 -1.045181 0.98887
H  1.413765 -1.032814 -0.78527
H  -2.322197 1.227595 1.171246
H  -2.41933 1.217813 -0.602682
H  2.820807 1.111372 0.947898
H  2.750682 1.121151 -0.826574
H  -3.748487 -0.957799 -0.494456
H  -3.671861 -0.91436 1.275079
H  -4.841218 1.355718 1.245093
H  -5.070662 1.199896 -0.505318
H  3.99899 -1.084167 -0.889292
H  4.064287 -1.098221 0.885225
H  5.334705 1.070716 -0.921845
H  5.39704 1.058764 0.852804
H  6.642107 -1.15038 0.792763
H  6.58387 -1.134207 -0.98206
H  7.977448 1.00547 0.768911
H  7.919645 1.02229 -1.005898
H  9.163834 -1.182795 -1.068104
H  9.219658 -1.202658 0.705441
H  10.593362 0.941688 0.693846
H  10.531823 0.968733 -1.090497
H  11.404103 -0.343847 -0.246959
