program: Gaussian 09
title: 000044295
version: EM64L-G09RevD.01
frameworkgroup: C1[X(C19H14O)]
method: RPBEPBE
basis: SDD
operation: Freq
keyword: #pfreq=noraman
keyword: PBEPBE/SDD
title: #p freq=noraman PBEPBE/SDD
converged: YES YES NO NO
title: Mulliken charges:
elementType: O C C C C C C C C C C C C C C C C C C C H H H H H H H H H H H H H H
charge: -0.275579 0.244455 0.487478 0.193622 0.168896 0.502451 -0.642051 -0.654945 0.421394 -0.499731 -0.476030 0.198387 -0.368563 -0.485646 -0.435114 -0.397084 -0.238609 -0.260968 -0.249716 -0.531878 0.230838 0.279298 0.242630 0.233418 0.223680 0.242566 0.238784 0.239136 0.222966 0.226789 0.228387 0.223431 0.244077 0.223232
chargesum: 0.00000
title: Mulliken charges with hydrogens summed into heavy atoms:
elementType: O C C C C C C C C C C C C C C C C C C C
charge: -0.275579 0.244455 0.487478 0.193622 0.168896 0.502451 -0.411213 -0.375647 0.421394 -0.257101 -0.242612 0.198387 -0.144883 -0.243080 -0.196330 -0.157948 -0.015643 -0.034179 -0.021330 0.158863
polarizability: 4.10872664e+02 -1.10177618e+01 2.30098212e+02 1.08820765e-01 8.53512139e-02 8.35323162e+01
1716.lowfreq: -4.6825 -0.0006 -0.0005 0.0002 8.0823 8.3074 43.9121 67.6010 101.8109
frequency: 43.8831 67.5996 101.8064 126.6347 137.2096 174.5044 198.9498 205.8167 251.1381 291.1792 291.3670 311.7389 349.9237 404.4177 405.7692 429.5841 461.5200 498.4951 517.1984 517.5988 532.4855 560.8328 575.1511 595.1007 602.7037 646.1456 706.7731 708.8544 727.4526 750.9643 757.8020 758.1001 799.4096 810.1338 830.6806 845.4781 859.5781 869.6642 886.0091 915.1261 920.9372 935.4542 955.8824 965.8559 981.1856 982.7732 991.1937 1040.4063 1066.2149 1079.4637 1108.7307 1114.0232 1154.0674 1155.4004 1177.4369 1183.5641 1209.3449 1212.1055 1231.6385 1248.7768 1265.4359 1285.5217 1302.7524 1331.6986 1386.3627 1400.7408 1404.6591 1428.4670 1437.4594 1440.2161 1449.5219 1454.4992 1466.2480 1469.7796 1480.6141 1504.9924 1557.2407 1569.4166 1593.5321 1616.2591 1626.3648 1636.3979 2961.5325 3050.2255 3118.5816 3121.0654 3126.3417 3127.0380 3130.5726 3136.6210 3144.0316 3148.2636 3149.8665 3156.3100 3164.3582 3169.1596
redmass: 4.4979 4.2623 3.5730 4.4984 3.6343 4.8664 5.2589 1.9192 1.6888 3.4365 3.5179 4.6595 5.6534 5.5936 3.0815 2.9409 5.6059 5.5865 6.9497 3.4381 2.9679 6.3051 3.0995 5.4005 4.4751 6.0163 2.8153 6.5117 5.8018 1.4317 1.4398 4.2254 1.8889 2.7194 1.5777 4.7097 1.4081 4.1339 1.7200 1.7449 6.8229 1.7155 1.4218 1.3539 6.1993 1.3857 1.3922 2.2371 2.3681 2.7591 2.2102 1.2609 1.3424 1.3516 1.0787 1.1627 1.8924 1.7584 1.8335 2.0264 1.9772 1.5232 2.3164 3.4020 5.2722 1.9590 4.2031 1.8571 3.0084 2.6832 2.2575 3.2092 1.0502 1.3285 2.0040 3.6151 5.5198 7.2593 5.7600 6.2353 6.7956 7.2141 1.0327 1.1040 1.0860 1.0861 1.0943 1.0916 1.0889 1.0905 1.0984 1.0940 1.0928 1.0913 1.0997 1.0957
irintensity: 1.1475 1.3899 4.1473 1.8191 1.8416 2.6086 0.5697 0.7765 0.2293 1.0948 1.5113 0.0062 0.1950 3.3014 0.0895 13.3986 1.4650 0.4972 3.8945 2.1873 0.5102 2.0114 5.9695 7.8518 3.6135 3.5835 13.5177 4.6633 11.1647 8.0917 74.6966 12.0813 2.6723 16.2937 50.6679 1.5870 8.1272 2.7668 1.0115 50.2179 6.1060 9.6326 9.0782 5.8875 20.0485 0.4743 0.0172 15.9507 40.9036 30.5859 27.1566 0.1391 7.8878 11.4892 0.6408 0.6746 106.4985 9.7256 0.2859 79.9822 14.2583 0.2149 0.9404 25.6042 6.3730 28.2442 0.2513 31.7771 5.0418 16.3155 18.4844 4.2398 13.6972 49.7323 0.7025 23.5733 25.5049 63.6146 1.5914 5.6776 4.6422 6.9932 88.7471 45.6091 0.2926 3.6058 15.0680 6.3660 8.7279 3.0063 30.9605 14.9911 45.6937 3.0108 42.2414 25.8784
temp: 298.150 k
press: 1.00000 atm
elementType: 8 6 6 6 6 6 6 6 6 6 6 6 6 6 6 6 6 6 6 6 1 1 1 1 1 1 1 1 1 1 1 1 1 1
symmnumber: 1
zpe: 706104.1 jmol-1
zpe.correction: 0.268941 hartree
zpe.thermalcorrener: 0.283972 hartree
zpe.thermalcorrenthalpy: 0.284916 hartree
zpe.thermalcorrgfe: 0.227081 hartree
zpe.sumelectzpe: -806.319142 hartree
zpe.sumelectthermal: -806.304111 hartree
zpe.sumelectthermalent: -806.303166 hartree
zpe.sumelectthermalfe: -806.361002 hartree
dipole: -1.9713 -0.0418 0.0182
dipole: 1.9718
quadrupole: -83.8567 -101.4809 -124.5172
quadrupole: 2.8542 -0.0580 0.0073
quadrupole: 19.4282 1.8040 -21.2322 2.8542 -0.0580 0.0073
hfenergy: -806.5880824 hartree
pointgroup: C01 [X(C19H14O1)]
dipole: -0.7724382 -0.062549 -0.0351846 debye
polarizability: 410.5342372|-0.1678507|229.4271888|18.1487411|-0.5858786|84.5417666 unknown
InChI: InChI=1S/C19H14O/c1-20-19-8-4-6-14-11-17-15(12-18(14)19)10-9-13-5-2-3-7-16(13)17/h2-12H,1H3
charge 0 multiplicity 1
34 atoms
O  -3.749782 -1.740993 -0.296631
C  0.957456 0.204046 -0.054519
C  0.404138 -1.142794 -0.079973
C  2.417999 0.373258 0.028983
C  -1.887057 -0.23424 -0.2087
C  -1.349884 1.114783 -0.187214
C  0.059309 1.29079 -0.110912
C  -0.994201 -1.331376 -0.155521
C  3.259929 -0.796026 0.079086
C  1.297036 -2.283219 -0.027281
C  2.663336 -2.118228 0.047979
C  -3.323361 -0.405511 -0.283538
C  3.047569 1.653198 0.064495
C  -2.252582 2.234238 -0.242965
C  4.677063 -0.645723 0.160488
C  -4.177007 0.699928 -0.335548
C  -3.626139 2.024374 -0.31517
C  4.443217 1.782057 0.144871
C  5.268505 0.624622 0.193197
C  -5.190732 -1.992626 -0.365791
H  0.43524 2.319302 -0.097277
H  -1.403325 -2.346155 -0.172785
H  0.856131 -3.286691 -0.048845
H  3.329092 -2.988576 0.086723
H  2.439901 2.562818 0.030107
H  -1.843202 3.250398 -0.227531
H  5.301143 -1.546783 0.197659
H  -5.262273 0.576699 -0.390536
H  -4.31134 2.878192 -0.357485
H  4.897868 2.778489 0.170772
H  6.357216 0.728229 0.255675
H  -5.713294 -1.566616 0.512503
H  -5.292208 -3.087666 -0.365802
H  -5.625362 -1.5757 -1.295013
