program: Gaussian 09
title: 000044289
version: EM64L-G09RevD.01
frameworkgroup: C1[X(C20H16ClN)]
method: RPBEPBE
basis: SDD
operation: Freq
keyword: #p
keyword: freq=noraman
keyword: PBEPBE/SDD
title: #p freq=noraman PBEPBE/SDD
converged: YES YES NO NO
title: Mulliken charges:
elementType: Cl N C C C C C C C C C C C C C C C C C C C C H H H H H H H H H H H H H H H H
charge: -0.051252 -0.048886 0.312085 0.280949 0.305837 -0.234452 -0.223305 -0.548326 0.239192 0.431218 -0.421859 0.462000 -0.407303 -0.509821 -0.688805 -0.383630 -0.324766 -0.290752 -0.438286 -0.805508 -0.241024 -0.241744 0.226112 0.224125 0.229200 0.235214 0.235237 0.233078 0.222817 0.234043 0.278923 0.255048 0.241916 0.239739 0.239535 0.273050 0.230970 0.229428
chargesum: 0.00000
title: Mulliken charges with hydrogens summed into heavy atoms:
elementType: Cl N C C C C C C C C C C C C C C C C C C C C
charge: -0.051252 -0.048886 0.312085 0.280949 0.305837 -0.234452 -0.223305 -0.098088 0.239192 0.431218 -0.192659 0.462000 -0.172089 -0.274584 0.001133 -0.104707 -0.324766 -0.035704 -0.196370 -0.053184 -0.010054 -0.012316
polarizability: 4.21019868e+02 -1.65490648e+01 2.78622619e+02 1.61806070e+00 -8.12180107e+00 1.02213953e+02
1716.lowfreq: -7.8999 -0.0023 -0.0010 -0.0006 3.4536 5.5754 47.3840 52.0005 62.0680
frequency: 47.3709 51.9807 61.9954 73.9245 80.9263 106.1077 116.2685 168.1392 179.7961 207.5481 223.7452 230.5969 269.7700 282.3378 291.8173 313.7488 335.2572 342.9068 404.5317 418.0901 426.5315 473.0791 499.0233 510.5178 533.6721 536.7359 566.6731 573.6229 581.8234 598.6244 615.9762 658.3548 669.0362 709.1067 738.9311 754.2181 763.8313 775.0793 808.3598 816.6072 824.1207 838.7941 853.2724 865.9312 893.8913 899.4662 949.0452 967.9746 973.4519 980.8627 983.8572 1004.6699 1015.6390 1031.3707 1042.9343 1057.0482 1083.1793 1096.8380 1141.5647 1158.8488 1164.6640 1174.7206 1201.2803 1228.2150 1236.3951 1242.4799 1264.1978 1274.2690 1302.2970 1316.3505 1335.2169 1364.5044 1385.1510 1389.5747 1394.7162 1409.4448 1416.5992 1431.3770 1447.4386 1454.1568 1470.3585 1472.3766 1475.6146 1485.0876 1490.3643 1519.0389 1539.7238 1553.5191 1563.3249 1591.6944 1614.1319 1626.0306 2985.3449 2988.2129 3018.7683 3058.3264 3062.2471 3084.2541 3090.5911 3123.4211 3125.8301 3126.8420 3137.7746 3151.0669 3156.6893 3158.4230 3173.9098 3175.4380
redmass: 3.8912 5.5514 3.2455 3.2076 1.0736 4.4551 6.7879 4.3545 4.1355 1.1467 4.2236 3.8929 4.9407 4.2916 5.6581 4.7905 4.1487 3.6618 3.9881 4.3409 3.2019 4.6419 4.7144 5.0158 3.7047 4.9434 5.3586 3.8778 5.1453 4.1812 6.5108 4.5984 6.4033 3.1870 2.3691 5.4869 1.4844 1.6799 2.4811 1.6446 1.6331 4.8832 3.7921 3.8974 4.0644 1.6692 1.3369 1.3854 2.9622 2.4162 1.5237 1.3492 1.9238 2.0778 1.4966 2.0182 2.4948 1.8883 1.7885 1.8074 1.3191 1.3693 1.8310 1.8700 2.0223 1.3576 1.9401 2.6187 1.4236 3.4468 3.5614 3.4255 1.3006 1.2501 5.4656 3.6104 2.3045 4.1827 3.4745 1.5241 1.8444 1.0463 1.0528 1.1098 2.9909 1.1850 7.6096 6.7979 8.0679 6.6677 6.4307 6.9124 1.0349 1.0382 1.0607 1.1000 1.0969 1.1000 1.1013 1.0866 1.0871 1.0976 1.0904 1.0869 1.0961 1.0954 1.0969 1.0971
irintensity: 0.1365 0.2499 0.1532 0.1748 0.3590 1.2803 0.1259 3.2427 3.0882 0.1204 0.2212 0.0709 4.5857 0.4337 2.1674 0.0116 2.1767 1.7550 4.6877 7.4246 6.4983 3.7652 0.4690 0.8082 0.0441 0.0748 2.9659 3.9151 4.8874 10.3918 6.8746 1.9759 9.2828 8.1868 2.0346 2.6935 5.4132 81.0980 5.1861 13.4689 24.2183 14.4920 23.1167 6.5984 26.4236 1.8411 0.1040 0.9694 7.0066 25.8015 13.5969 0.2345 88.1306 9.0738 3.1962 20.5284 10.4931 0.8605 0.9915 6.9824 6.2149 1.1237 1.6091 4.2468 3.4298 2.1013 2.3999 9.1375 0.7017 12.1315 6.0683 7.8295 29.3012 9.4505 8.1922 16.6923 18.5684 24.2745 15.7531 0.2344 46.1409 9.2131 12.7570 1.9477 29.8828 24.7607 23.5456 7.0837 5.2698 48.1059 5.0349 3.2588 36.7498 17.6489 28.6986 2.6470 13.4710 49.8829 31.4776 0.8762 4.3734 3.5396 15.6070 4.9017 31.1832 35.2415 21.2176 11.3717
temp: 298.150 k
press: 1.00000 atm
elementType: 17 7 6 6 6 6 6 6 6 6 6 6 6 6 6 6 6 6 6 6 6 6 1 1 1 1 1 1 1 1 1 1 1 1 1 1 1 1
symmnumber: 1
zpe: 783140.6 jmol-1
zpe.correction: 0.298282 hartree
zpe.thermalcorrener: 0.316651 hartree
zpe.thermalcorrenthalpy: 0.317595 hartree
zpe.thermalcorrgfe: 0.251635 hartree
zpe.sumelectzpe: -1285.075929 hartree
zpe.sumelectthermal: -1285.057560 hartree
zpe.sumelectthermalent: -1285.056616 hartree
zpe.sumelectthermalfe: -1285.122576 hartree
dipole: 1.9665 3.0192 -0.0439
dipole: 3.6034
quadrupole: -127.8615 -118.0580 -141.2754
quadrupole: -6.2836 0.4919 -1.5608
quadrupole: 1.2034 11.0070 -12.2104 -6.2836 0.4919 -1.5608
hfenergy: -1285.374211 hartree
pointgroup: C01 [X(C20H16Cl1N1)]
dipole: 0.6269483 1.2714423 -0.0160202 debye
polarizability: 422.9320925|0.6763418|276.7808368|0.9587144|-7.2682773|102.1435108 unknown
InChI: InChI=1S/C20H16ClN/c1-3-14-16-10-11-18(21)12(2)19(16)22-20-15-7-5-4-6-13(15)8-9-17(14)20/h4-11H,3H2,1-2H3
charge 0 multiplicity 1
38 atoms
Cl -5.186016 -2.401122 0.102665
N  -0.162183 -1.031304 -0.008813
C  -0.761367 1.772348 -0.240856
C  0.587022 1.316159 -0.179087
C  -1.81756 0.804238 -0.156583
C  0.837587 -0.114023 -0.065443
C  -1.466287 -0.607387 -0.046106
C  -1.079677 3.256721 -0.345988
C  2.219962 -0.608389 -0.006755
C  3.308641 0.327239 -0.051219
C  1.726781 2.21535 -0.215749
C  -2.50225 -1.626671 0.030767
C  -3.209437 1.16266 -0.169548
C  3.021863 1.744041 -0.153845
C  -1.19517 3.933813 1.048914
C  2.504327 -1.999764 0.096082
C  -3.823963 -1.182584 0.006895
C  -4.200105 0.189818 -0.087763
C  4.650131 -0.155909 0.00787
C  -2.135473 -3.089286 0.133006
C  3.830219 -2.456683 0.152645
C  4.911067 -1.53029 0.108322
H  -0.301983 3.771949 -0.935949
H  -2.020992 3.407269 -0.902337
H  1.555069 3.293382 -0.287322
H  -3.508353 2.212214 -0.238723
H  3.865019 2.444684 -0.181628
H  -1.994576 3.466653 1.651138
H  -1.42627 5.009165 0.942723
H  -0.251054 3.837276 1.613893
H  1.659561 -2.693069 0.129616
H  -5.25966 0.459939 -0.095976
H  5.476682 0.563777 -0.026198
H  -2.541262 -3.533901 1.060421
H  -2.565189 -3.662845 -0.708807
H  -1.041707 -3.194457 0.126799
H  4.036835 -3.529556 0.231482
H  5.943772 -1.893254 0.153061
