program: Gaussian 09
title: 000044273
version: EM64L-G09RevD.01
frameworkgroup: C1[X(C20H13N)]
method: RPBEPBE
basis: SDD
operation: Freq
keyword: #pfreq=noraman
keyword: PBEPBE/SDD
title: #p freq=noraman PBEPBE/SDD
converged: NO YES NO YES
title: Mulliken charges:
elementType: N C C C C C C C C C C C C C C C C C C C C H H H H H H H H H H H H H
charge: -0.031118 0.296041 0.340251 0.099406 0.149903 0.144604 0.488862 -0.779020 0.442390 -0.482804 -0.519836 0.261414 -0.823221 -0.464439 -0.345023 -0.438830 -0.385941 -0.254473 -0.260358 -0.249647 -0.315393 0.230808 0.224689 0.234808 0.257966 0.257974 0.237863 0.254266 0.221795 0.244140 0.258966 0.241887 0.229835 0.232234
chargesum: 0.00000
title: Mulliken charges with hydrogens summed into heavy atoms:
elementType: N C C C C C C C C C C C C C C C C C C C C
charge: -0.031118 0.296041 0.340251 0.099406 0.149903 0.144604 0.488862 -0.548213 0.442390 -0.258115 -0.285028 0.261414 -0.069418 -0.210173 -0.123228 -0.194689 -0.126975 -0.012585 -0.030523 -0.017413 -0.315393
polarizability: 4.28867330e+02 5.33197157e-01 2.52716763e+02 4.79637347e-03 3.61743573e-03 8.64579306e+01
1716.lowfreq: -13.3078 -5.4653 -4.8600 -0.0006 0.0003 0.0008 13.8235 38.1330 72.4255
frequency: -5.0131 38.0485 72.4211 124.2205 140.8247 181.2920 182.5266 189.4897 204.5135 287.9959 293.0651 293.3957 337.7950 366.2491 403.4588 404.5724 414.7000 461.6505 494.2364 513.5467 518.0270 524.1159 552.0534 561.3941 586.1727 587.9334 619.0001 624.2295 647.0469 704.8694 725.7966 757.8068 759.3418 771.2532 802.4063 824.5737 827.1963 848.3227 869.6081 886.3433 906.9630 912.6311 945.2736 956.1242 981.5030 986.2485 989.3689 993.2833 1034.3089 1040.4692 1041.8209 1080.7663 1092.6841 1133.4259 1170.4341 1175.1296 1180.9884 1220.2469 1239.9223 1250.1603 1255.0081 1272.0306 1325.3830 1345.2982 1366.2544 1378.0367 1402.9558 1404.5548 1414.1560 1419.9801 1438.0180 1455.4343 1465.8860 1484.7124 1494.1946 1507.1614 1548.4822 1565.1060 1591.0313 1607.4204 1619.7918 1625.8928 2156.8904 3004.5837 3075.6718 3124.8535 3128.1779 3128.9535 3133.5390 3134.9353 3144.2543 3150.0908 3154.6241 3167.6722 3171.1826 3182.9262
redmass: 3.5997 4.5767 4.4646 3.8801 8.3314 6.5815 3.2562 1.9602 1.8486 4.7515 3.4995 6.8726 4.5247 4.2640 6.1837 4.6650 3.3720 5.2561 3.8979 6.9577 3.3716 5.7189 6.0513 2.7607 3.2085 5.9231 6.7841 5.0869 6.2171 2.5887 5.5678 5.8501 1.3398 1.5869 1.7272 2.4658 4.2652 1.8218 4.3213 1.6646 4.5686 1.8421 1.7035 1.3840 1.3853 4.2182 1.4212 1.3780 1.6260 2.3692 2.4726 2.6598 2.0300 2.2832 1.6059 1.2341 1.0947 1.6688 1.8259 1.9089 1.8117 1.7815 2.8317 4.9322 3.5143 2.6923 2.8011 5.7632 1.4190 2.1246 2.8807 3.0234 2.1648 1.0431 1.6819 2.5730 4.8335 6.9127 5.6439 5.9713 6.5186 6.7111 12.6368 1.0421 1.0972 1.0867 1.0896 1.0886 1.0929 1.0889 1.0918 1.0911 1.0922 1.0994 1.0994 1.0912
irintensity: 1.1159 0.5336 1.7009 1.4169 3.0162 1.9421 2.0008 0.4562 0.0740 1.1928 2.3407 1.5155 1.3333 0.0879 0.4796 5.5536 1.6381 1.6505 7.1644 0.2803 0.3767 0.2320 2.4933 4.2963 2.6144 3.7995 0.5974 0.6632 2.9463 12.1182 2.8162 1.3514 68.0593 7.6983 3.5410 28.3870 5.1356 68.5876 1.8817 0.5786 2.3316 17.0210 4.1381 3.0891 1.4076 3.2237 3.7281 0.5767 3.0877 7.1979 9.4297 2.4207 1.6692 6.1929 0.0965 3.4397 0.8074 1.3005 7.4323 6.8939 3.6531 11.2971 5.3246 16.8503 4.6807 1.4975 1.0906 0.5710 24.4253 8.4296 10.7851 0.3196 17.9062 15.2394 32.0537 21.4466 6.2041 0.1959 5.5358 1.6802 2.1332 0.6943 52.0176 11.3553 7.4217 0.8443 19.2356 2.1000 7.2742 7.1806 5.4485 7.4325 27.0718 38.9585 18.8609 24.2105
temp: 298.150 k
press: 1.00000 atm
elementType: 7 6 6 6 6 6 6 6 6 6 6 6 6 6 6 6 6 6 6 6 6 1 1 1 1 1 1 1 1 1 1 1 1 1
symmnumber: 1
zpe: 691312.3 jmol-1
zpe.correction: 0.263307 hartree
zpe.thermalcorrener: 0.278264 hartree
zpe.thermalcorrenthalpy: 0.279208 hartree
zpe.thermalcorrgfe: 0.221666 hartree
zpe.sumelectzpe: -823.311852 hartree
zpe.sumelectthermal: -823.296895 hartree
zpe.sumelectthermalent: -823.295951 hartree
zpe.sumelectthermalfe: -823.353493 hartree
dipole: 3.8211 2.7800 0.0008
dipole: 4.7254
quadrupole: -125.7947 -106.4516 -128.3283
quadrupole: -16.3865 -0.0049 -0.0022
quadrupole: -5.6032 13.7399 -8.1368 -16.3865 -0.0049 -0.0022
hfenergy: -823.575159 hartree
pointgroup: C01 [X(C20H13N1)]
dipole: 1.4928209 1.1080525 0.0003031 debye
polarizability: 428.8410066|2.2182162|252.743086|0.0047615|0.0036632|86.4579306 unknown
InChI: InChI=1S/C20H13N/c1-13-17-10-9-14-5-2-3-8-18(14)19(17)11-15-6-4-7-16(12-21)20(13)15/h2-11H,1H3
charge 0 multiplicity 1
34 atoms
N  -5.077085 -1.958614 -0.000646
C  0.952133 0.264072 0.000076
C  0.296859 -1.041624 0.000118
C  -1.132898 -1.149038 0.000209
C  -1.93935 0.043348 0.000084
C  2.423376 0.359128 0.000029
C  -1.271875 1.339432 0.000078
C  0.143841 1.41087 0.000104
C  3.206854 -0.845987 -0.000008
C  1.154109 -2.216466 0.000039
C  2.529518 -2.123709 -0.000024
C  -3.399609 0.074352 -0.000055
C  -1.806278 -2.511502 0.000502
C  -2.029376 2.559364 0.00006
C  3.119724 1.60463 0.000012
C  4.631764 -0.775743 -0.000051
C  -4.101477 1.297662 -0.000074
C  -3.420198 2.546451 0.000016
C  4.522631 1.659302 -0.000026
C  5.289373 0.461602 -0.000057
C  -4.259858 -1.083157 -0.000306
H  0.59314 2.408508 0.000127
H  0.708089 -3.212566 -0.000028
H  3.139395 -3.034957 -0.0001
H  -2.451615 -2.642849 0.886579
H  -2.450942 -2.643608 -0.885961
H  -1.091545 -3.343606 0.001167
H  -1.482778 3.509514 0.000079
H  2.564841 2.54734 0.00003
H  5.206966 -1.709087 -0.000078
H  -5.195849 1.274131 -0.000186
H  -3.993252 3.478388 0.000009
H  5.028706 2.630747 -0.000035
H  6.383464 0.509375 -0.000086
