program: Gaussian 09
title: 000005143
version: EM64L-G09RevD.01
frameworkgroup: C1[X(C7H5NO3S)]
method: RPBEPBE
basis: SDD
operation: Freq
keyword: #p
keyword: freq=noraman
keyword: PBEPBE/SDD
title: #p freq=noraman PBEPBE/SDD
converged: NO NO NO NO
title: Mulliken charges:
elementType: S O O O N C C C C C C C H H H H H
charge: 0.955315 -0.476988 -0.476964 -0.221107 -0.649916 -0.128367 0.290425 0.253356 -0.243792 -0.324356 -0.205234 -0.198785 0.369014 0.275387 0.282774 0.251671 0.247568
chargesum: 0.00000
title: Mulliken charges with hydrogens summed into heavy atoms:
elementType: S O O O N C C C C C C C
charge: 0.955315 -0.476988 -0.476964 -0.221107 -0.280902 -0.128367 0.290425 0.253356 0.031595 -0.041582 0.046437 0.048782
polarizability: 1.43258568e+02 4.88230538e+00 1.29116786e+02 -5.34344616e-03 4.59462165e-03 6.43400144e+01
1716.lowfreq: -6.9791 -5.6975 0.0018 0.0028 0.0029 4.1568 85.3426 95.1331 139.5777
frequency: 85.3419 95.1293 139.5771 181.8617 221.4404 251.3571 291.3672 322.8871 409.0190 414.4878 440.1639 458.5222 492.4219 552.9655 565.0065 647.9544 664.5655 681.2240 745.3047 759.6840 785.2249 837.0523 890.3730 961.7128 971.0830 998.9923 1010.7190 1015.0733 1111.6447 1127.9958 1176.9043 1202.3472 1249.3252 1285.5835 1397.6229 1432.5141 1449.9323 1582.5832 1609.4602 1632.6533 3149.3883 3160.1643 3170.3689 3181.5249 3560.1161
redmass: 8.2611 8.7731 6.3363 8.0111 4.7605 11.6571 9.4061 8.5771 15.1302 3.1438 14.6527 8.2792 3.5484 7.1747 1.2810 6.5203 4.3146 5.6536 2.7532 4.6739 1.5913 16.7071 1.3622 19.8748 1.3932 7.2339 1.3615 2.2703 1.7805 2.3706 1.1028 1.5514 1.9153 2.3108 9.5975 2.2674 2.4782 6.7665 7.8119 10.1639 1.0869 1.0906 1.0958 1.1008 1.0803
irintensity: 3.2858 0.0239 0.2913 5.1393 3.3197 6.8517 18.3046 4.5406 44.5643 10.2836 58.9008 1.3108 1.0159 3.9754 113.2106 1.4045 50.0983 27.7733 32.5703 3.2159 40.9872 105.5792 2.1794 105.8658 1.5018 1.1935 0.4151 4.7137 13.3567 20.4008 2.4528 49.5066 50.0844 114.8667 1.5805 13.9435 18.2746 19.7507 17.7926 227.2103 2.4742 1.3622 0.7059 12.4968 105.6518
temp: 298.150 k
press: 1.00000 atm
elementType: 16 8 8 8 7 6 6 6 6 6 6 6 1 1 1 1 1
symmnumber: 1
zpe: 289320.7 jmol-1
zpe.correction: 0.110196 hartree
zpe.thermalcorrener: 0.120451 hartree
zpe.thermalcorrenthalpy: 0.121395 hartree
zpe.thermalcorrgfe: 0.074203 hartree
zpe.sumelectzpe: -947.205912 hartree
zpe.sumelectthermal: -947.195658 hartree
zpe.sumelectthermalent: -947.194714 hartree
zpe.sumelectthermalfe: -947.241906 hartree
dipole: 4.7738 -1.4319 0.0007
dipole: 4.9839
quadrupole: -69.1091 -79.5819 -84.9193
quadrupole: -12.9428 0.0002 -0.0039
quadrupole: 8.7610 -1.7118 -7.0492 -12.9428 0.0002 -0.0039
hfenergy: -947.3161084 hartree
pointgroup: C01 [X(C7H5N1O3S1)]
dipole: 1.9487174 -0.2174782 -0.0003323 debye
dipolederiv: 1.4432471 0.0923324 -0.0002121 0.3823263 1.7005512 -0.0000336 -0.0002047 -0.0000579 1.4105637 -0.5966563 -0.0603011 0.0224921 -0.1257339 -0.525122 0.0099392 0.1414071 0.1540267 -0.5905093 -0.5967147 -0.0603143 -0.0222876 -0.125912 -0.5252009 -0.0101147 -0.1412603 -0.1540446 -0.5903253 -0.5621135 -0.1406692 0.0000968 -0.0585861 -1.1745393 0.0002168 -0.0000002 -0.000108 -0.3126109 -0.9758682 -0.3471877 -0.0000489 -0.1639305 -0.8680056 0.0001235 -0.0002987 0.000259 -0.5898354 0.093897 -0.0378572 -0.000088 -0.1821163 -0.0155029 -0.000052 -0.0000131 -0.0000422 -0.2300042 -0.4215437 0.1088156 0.0001009 0.3308338 -0.2229115 -0.0000762 0.0000894 0.0000537 0.0555246 1.326964 0.4745296 -0.000208 0.0282393 1.2811483 -0.0001047 -0.0000703 -0.0002138 0.2346078 -0.3030883 0.1609459 0.0000113 -0.1034512 0.0488929 0.0000044 0.0000682 -0.0000462 -0.0600664 -0.0309693 0.0171529 -0.0000212 0.0320903 0.0878468 -0.0000751 -0.0000379 -0.0000428 -0.0847053 0.0984847 -0.1419436 -0.0000333 0.0299239 0.0284878 -0.0000395 -0.0001054 0.0000104 -0.1170722 0.1774012 0.0606665 -0.000103 0.0160637 -0.0715582 -0.0000097 -0.0000813 -0.0000295 -0.1255166 0.2505433 -0.1201299 0.0001293 -0.0383695 0.1036882 0.0000666 0.0003143 0.000107 0.3630075 0.0966321 -0.056891 0.0000359 -0.012683 0.0282263 0.0000465 0.0000621 0.0000412 0.1544296 0.0893926 0.0044967 0.0000235 -0.0443257 0.0177107 0.0000618 0.0000113 0.0000564 0.1619839 -0.0123528 0.0794156 0.000032 0.0735248 0.0178088 0.0000173 0.0000324 0.0000097 0.1623918 -0.0772552 -0.0330611 0.0000804 -0.037894 0.0884794 0.0000293 0.0000872 0.0000209 0.1581369 unknown
polarizability: 141.0814742|7.0629296|131.2938662|-0.0319908|-0.0096253|64.3400276 unknown
InChI: InChI=1S/C7H5NO3S/c9-7-5-3-1-2-4-6(5)12(10,11)8-7/h1-4,8H
charge 0 multiplicity 1
17 atoms
S  -1.7090 -0.881827 0.001261
O  -2.262782 -1.492075 1.395005
O  -2.262579 -1.493624 -1.391868
O  -0.522095 2.937628 0.000333
N  -1.838659 0.993547 0.00059
C  0.173298 -0.660044 0.000765
C  0.511875 0.703664 0.000234
C  -0.628771 1.681982 0.000131
C  1.099433 -1.705076 0.000718
C  1.876151 1.059143 -0.000246
C  2.468745 -1.332171 0.000209
C  2.848936 0.032775 -0.000257
H  -2.754164 1.451479 0.001375
H  0.795334 -2.755601 0.001086
H  2.148129 2.119448 -0.000668
H  3.236337 -2.112469 0.000187
H  3.911512 0.295219 -0.000655
