program: Gaussian 09
title: 000044227
version: EM64L-G09RevD.01
frameworkgroup: C1[X(C13H9N3O3)]
method: RPBEPBE
basis: SDD
operation: Freq
keyword: #p
keyword: freq=noraman
keyword: PBEPBE/SDD
title: #p freq=noraman PBEPBE/SDD
converged: NO YES NO NO
title: Mulliken charges:
elementType: O O O N N N C C C C C C C C C C C C C H H H H H H H H H
charge: -0.225725 -0.224235 -0.173063 -0.505655 0.018762 0.070745 0.484503 0.479048 -0.419262 -0.354456 0.385042 -0.416294 -0.355828 -0.345794 -0.369078 -0.357478 -0.379726 0.390156 -0.126677 0.309353 0.235635 0.275299 0.242184 0.278452 0.287569 0.286573 0.254711 0.255237
chargesum: 0.00000
title: Mulliken charges with hydrogens summed into heavy atoms:
elementType: O O O N N N C C C C C C C C C C C C C
charge: -0.225725 -0.224235 -0.173063 -0.196302 0.018762 0.070745 0.484503 0.479048 -0.183627 -0.079157 0.385042 -0.174110 -0.077376 -0.058225 -0.082505 -0.102767 -0.124489 0.390156 -0.126677
polarizability: 4.47574288e+02 2.48601718e+00 1.64377020e+02 8.60169234e+00 -1.17924723e+00 7.69742587e+01
1716.lowfreq: -37.8653 0.0007 0.0008 0.0009 1.3215 4.5459 10.2301 27.6885 39.3071
frequency: -37.8608 27.4068 39.2746 51.1137 72.3087 94.1562 123.3448 165.2099 200.7180 239.9892 274.2632 319.6979 365.0318 379.9078 410.1763 413.6704 422.9402 468.0779 481.9242 487.4045 488.8282 512.8091 517.5596 553.9493 620.7923 625.1340 654.3741 663.1465 698.2763 722.3200 730.2899 770.6394 808.8298 815.6248 832.0901 837.0173 859.7343 870.0360 951.1599 962.5220 980.5153 992.5293 994.6641 998.7886 1098.2139 1099.4964 1112.0840 1123.1132 1178.8983 1188.7731 1226.8820 1231.9970 1269.5698 1305.1323 1312.1777 1347.5715 1354.4995 1390.0996 1430.2264 1445.1263 1450.0562 1487.5219 1511.4024 1543.2748 1576.0905 1594.2129 1614.8633 1628.4037 2388.2740 3128.7360 3130.8191 3153.6088 3166.4157 3167.7605 3175.3650 3183.4641 3186.8411 3531.9238
redmass: 11.2424 6.5564 7.3234 6.1995 9.4567 5.8972 6.3070 8.3567 9.0687 7.4761 6.1641 5.3467 5.2026 8.7321 3.0466 3.8892 3.4182 10.9008 3.9804 5.1770 4.6244 5.6840 2.9404 1.5558 6.6930 6.8795 7.4285 4.9879 5.1125 4.2965 5.1203 6.9804 3.3375 1.3366 1.5087 1.6924 1.5959 4.7113 1.3655 1.3473 1.3273 1.8513 1.8229 3.0307 3.2530 3.6550 1.3478 1.2899 1.4264 1.1652 3.4093 3.6608 1.4292 1.3383 1.8155 4.6474 5.2413 5.5704 4.3489 3.9232 3.6417 2.2047 2.9067 5.4599 6.0758 4.1471 6.4648 6.5441 12.7388 1.0906 1.0897 1.0886 1.0917 1.0934 1.0966 1.0946 1.0967 1.0755
irintensity: 0.1316 1.3875 1.3468 0.9162 0.2043 0.6294 2.8097 1.1413 2.2558 0.6410 4.6512 5.6471 13.9504 5.6724 1.6022 5.8021 1.1004 7.0231 9.8969 52.0494 46.9946 9.1846 45.3673 76.8571 0.2799 4.8254 5.3982 26.5216 2.5303 8.6482 4.2379 7.0143 7.7421 5.8992 0.8334 150.8240 19.4054 1.6075 1.4970 2.5757 1.8741 1.0770 0.5091 6.5395 67.3008 66.5570 7.6269 27.4519 342.1725 30.2959 571.4005 175.2400 9.1177 1.7972 41.1922 103.3078 118.1622 64.1086 0.4754 91.7059 131.3496 18.3376 219.6695 253.5871 10.0163 40.1648 467.0057 52.4604 2132.6574 9.4578 13.2601 12.6522 6.4775 5.4019 1.2470 0.4961 4.6407 38.1920
temp: 298.150 k
press: 1.00000 atm
elementType: 8 8 8 7 7 7 6 6 6 6 6 6 6 6 6 6 6 6 6 1 1 1 1 1 1 1 1 1
symmnumber: 1
zpe: 521758.1 jmol-1
zpe.correction: 0.198727 hartree
zpe.thermalcorrener: 0.213890 hartree
zpe.thermalcorrenthalpy: 0.214835 hartree
zpe.thermalcorrgfe: 0.154358 hartree
zpe.sumelectzpe: -889.324197 hartree
zpe.sumelectthermal: -889.309034 hartree
zpe.sumelectthermalent: -889.308090 hartree
zpe.sumelectthermalfe: -889.368566 hartree
dipole: -3.6785 4.7539 0.1186
dipole: 6.0120
quadrupole: -183.2677 -98.4902 -109.2182
quadrupole: 3.5283 2.5728 -2.5114
quadrupole: -52.9423 31.8351 21.1072 3.5283 2.5728 -2.5114
hfenergy: -889.5229241 hartree
pointgroup: C01 [X(C13H9N3O3)]
dipole: 1.481813 1.8298408 0.2249426 debye
polarizability: 447.3492628|-9.0255695|162.4231635|8.1127139|13.56989|79.1531403 unknown
InChI: InChI=1S/C13H9N3O3/c17-9-14-10-1-3-11(4-2-10)15-12-5-7-13(8-6-12)16(18)19/h1-8,15H
charge 0 multiplicity 1
28 atoms
O  -6.302462 0.045222 -0.262683
O  -5.424988 -2.041307 0.060308
O  7.375931 -1.507059 -0.241741
N  -0.097883 1.537197 0.175011
N  -5.302185 -0.758129 -0.07605
N  5.124036 -0.602052 -0.123184
C  -1.356276 0.925624 0.094563
C  1.191499 0.948175 0.106124
C  -2.497191 1.759144 -0.12477
C  -1.552785 -0.478333 0.271336
C  -3.953535 -0.180796 -0.015508
C  2.265962 1.589973 0.781418
C  1.466089 -0.214718 -0.665039
C  -3.786388 1.215365 -0.177415
C  -2.842648 -1.025525 0.21603
C  3.574435 1.083897 0.701528
C  2.77151 -0.731938 -0.734717
C  3.840493 -0.092674 -0.050103
C  6.242369 -1.055267 -0.175284
H  -0.109774 2.549447 0.31706
H  -2.358401 2.838067 -0.263825
H  -0.703678 -1.128459 0.494499
H  2.071395 2.484512 1.384786
H  0.671464 -0.693217 -1.243672
H  -4.665547 1.841611 -0.349446
H  -3.011099 -2.09566 0.363376
H  4.394283 1.583618 1.226387
H  2.976974 -1.623517 -1.335189
