program: Gaussian 09
title: 000044276
version: EM64L-G09RevD.01
frameworkgroup: C1[X(C23H22)]
method: RPBEPBE
basis: SDD
operation: Freq
keyword: #p
keyword: freq=noraman
keyword: PBEPBE/SDD
title: #p freq=noraman PBEPBE/SDD
converged: YES YES NO NO
title: Mulliken charges:
elementType: C C C C C C C C C C C C C C C C C C C C C C C H H H H H H H H H H H H H H H H H H H H H H
charge: -0.594093 0.206502 0.407250 -0.384551 0.478624 0.241272 0.485508 -0.334563 -0.705131 -0.685548 0.193924 -0.462472 -0.360262 -0.492758 0.416537 -0.519154 -0.248402 -0.475616 -0.368131 -0.435472 -0.695171 -0.260072 -0.250945 0.211775 0.216936 0.218511 0.210444 0.185055 0.187631 0.249479 0.230701 0.235722 0.197337 0.197523 0.244928 0.241930 0.225076 0.233685 0.224368 0.239069 0.209860 0.216948 0.209613 0.227268 0.228862
chargesum: 0.00000
title: Mulliken charges with hydrogens summed into heavy atoms:
elementType: C C C C C C C C C C C C C C C C C C C C C C C
charge: -0.165382 0.206502 0.407250 0.044404 0.478624 0.241272 0.485508 0.038124 -0.455652 -0.454848 0.193924 -0.226749 0.034599 -0.247830 0.416537 -0.277224 -0.023326 -0.241931 -0.143763 -0.196403 -0.058750 -0.032804 -0.022083
polarizability: 4.17767111e+02 5.92274879e+01 2.95466354e+02 -2.81772327e+01 2.33242028e+01 1.31514549e+02
1716.lowfreq: -10.8144 -4.4154 -0.0004 0.0004 0.0007 7.2704 24.3660 31.8475 64.1877
frequency: 23.8612 31.7737 64.1346 72.7691 74.0048 99.0765 137.7897 144.3473 148.4378 160.7083 180.7771 226.3477 238.3248 258.3075 287.4457 297.4914 335.3550 352.3143 395.8666 405.7366 422.5530 438.3753 447.7250 498.2001 519.6467 527.3327 535.2852 561.0984 570.6500 576.7935 625.5101 645.7498 708.8380 714.2146 728.8489 738.6469 755.2320 756.4221 761.6502 766.4106 801.4512 814.7973 827.1685 838.3595 861.8821 870.4909 885.3282 895.1466 900.0463 911.2346 934.4432 940.9983 955.9599 956.3853 979.7259 981.8317 990.9347 997.7057 1026.9930 1041.5193 1041.7672 1072.7853 1074.7374 1103.8048 1108.7670 1114.4079 1155.7563 1174.4071 1177.9539 1197.8301 1212.6170 1215.2218 1231.3567 1237.3199 1252.2000 1253.9104 1273.8741 1283.8646 1289.6295 1292.2608 1302.6624 1304.5086 1334.0642 1338.8385 1351.3235 1386.4569 1392.5682 1401.8260 1405.0269 1427.7060 1433.6356 1448.0732 1455.7207 1465.4044 1469.6800 1472.5222 1478.4357 1479.4410 1486.9497 1494.6921 1504.6500 1559.1889 1575.3471 1594.6911 1615.6034 1626.8721 1632.2965 2950.9629 2967.6791 2972.2985 2973.3152 2982.7752 2991.2813 3015.0858 3026.5069 3049.1688 3068.9750 3071.8186 3117.0130 3117.4414 3121.6536 3126.0635 3130.3286 3133.1366 3136.6881 3143.0619 3149.9431 3153.9097 3164.8667
redmass: 4.3349 4.3418 3.1169 2.6102 2.4562 2.8930 3.6333 2.0710 4.2603 3.5032 4.1373 3.6821 1.1354 3.6631 3.6124 4.8296 3.3009 5.4916 3.3210 3.0947 3.0593 3.4905 3.7829 5.4604 3.4114 3.9205 3.9260 4.5310 6.4862 3.1369 4.6511 6.2202 3.4237 4.7335 1.0767 4.2854 1.5219 1.6131 1.9221 1.4645 1.8544 2.3192 1.5042 1.5151 2.8438 4.0375 1.5838 1.8541 1.6620 1.6539 1.9958 3.8539 1.3809 1.3983 1.3955 1.3875 1.3777 3.6089 2.5409 2.3554 2.5931 2.5526 2.3548 1.8064 2.0202 1.8782 1.3487 1.2048 1.0797 1.5990 1.6246 1.6954 1.7966 1.3015 1.7162 1.4107 1.7809 1.1349 1.1513 1.3750 1.7111 1.7152 2.6373 1.6378 1.6156 4.8166 1.2160 1.9265 4.2733 4.4854 3.0457 2.9032 3.3767 1.0695 1.0789 3.1361 1.0709 1.0495 1.0847 1.1183 3.3799 5.7174 7.2648 5.5064 6.0616 6.7569 6.8034 1.0589 1.0589 1.0387 1.0573 1.0596 1.0981 1.1001 1.1028 1.1042 1.1007 1.0992 1.0858 1.0862 1.0863 1.0914 1.0895 1.0897 1.0903 1.0979 1.0930 1.0990 1.1000
irintensity: 0.0411 0.0541 0.3175 0.3376 0.0065 0.0737 0.2244 0.0308 0.2721 0.6141 0.7385 2.7470 0.0416 0.3836 0.3992 0.2182 0.7995 0.2401 1.3798 0.4594 4.0727 9.3803 5.0104 0.3635 1.3218 1.5512 1.4444 3.3867 4.9549 4.3863 1.6649 3.4773 8.3850 2.4931 9.7672 1.2470 6.6607 19.6292 3.1625 59.3749 0.2829 7.3144 33.1259 7.1544 1.9853 1.8576 1.8618 12.8146 29.4940 34.5986 1.9180 0.6734 1.9778 5.7755 3.9445 0.0229 0.0292 1.0433 2.9771 7.8555 0.5055 1.9525 0.3765 10.5063 14.5309 5.7903 2.0478 2.5538 0.6383 0.6152 6.1365 5.8503 4.0970 2.5864 10.3838 3.8066 1.0848 0.9431 0.2901 0.6025 0.2304 0.9388 4.4329 0.7722 0.6506 4.8997 10.7709 6.6565 0.0842 6.6987 7.2567 0.3476 3.0829 0.0578 2.4001 3.1865 1.5662 11.1905 5.1414 25.5768 16.2521 3.4975 8.1114 0.8544 3.2438 1.6880 0.9384 15.8048 36.1033 36.7439 7.8872 94.9867 2.1878 4.5503 5.8284 66.0588 89.7482 51.4217 0.3910 6.9228 3.7271 12.9585 21.3654 5.7314 1.8883 36.6092 28.1732 47.2997 41.0646
temp: 298.150 k
press: 1.00000 atm
elementType: 6 6 6 6 6 6 6 6 6 6 6 6 6 6 6 6 6 6 6 6 6 6 6 1 1 1 1 1 1 1 1 1 1 1 1 1 1 1 1 1 1 1 1 1 1
symmnumber: 1
zpe: 989390.0 jmol-1
zpe.correction: 0.376839 hartree
zpe.thermalcorrener: 0.396273 hartree
zpe.thermalcorrenthalpy: 0.397217 hartree
zpe.thermalcorrgfe: 0.328154 hartree
zpe.sumelectzpe: -888.086090 hartree
zpe.sumelectthermal: -888.066656 hartree
zpe.sumelectthermalent: -888.065712 hartree
zpe.sumelectthermalfe: -888.134775 hartree
dipole: 0.5409 -0.2216 0.1183
dipole: 0.5964
quadrupole: -119.8520 -123.4190 -143.1339
quadrupole: 1.4441 -3.9351 5.5063
quadrupole: 8.9496 5.3826 -14.3322 1.4441 -3.9351 5.5063
hfenergy: -888.4629292 hartree
pointgroup: C01 [X(C23H22)]
dipole: -0.2098452 -0.0938652 -0.0470399 debye
polarizability: 421.4915637|-54.0853723|292.3077188|-30.8441982|-20.2218591|130.9487317 unknown
InChI: InChI=1S/C23H22/c1-2-3-4-8-17-10-7-11-19-16-23-20(15-22(17)19)14-13-18-9-5-6-12-21(18)23/h5-7,9-16H,2-4,8H2,1H3
charge 0 multiplicity 1
45 atoms
C  -3.540935 0.456722 0.938894
C  -1.071489 1.032919 0.390637
C  -2.452131 1.449712 0.559487
C  -4.024419 -0.41083 -0.258878
C  -0.075904 2.009612 -0.029946
C  1.708211 0.282521 0.018781
C  0.714757 -0.690505 0.449157
C  -5.148028 -1.395614 0.132251
C  -0.631296 -0.298889 0.620185
C  1.277278 1.605698 -0.203462
C  3.103891 -0.151048 -0.160469
C  -2.782217 2.789359 0.328622
C  -5.633448 -2.263647 -1.051289
C  -0.476662 3.370434 -0.261563
C  3.452478 -1.52497 0.100386
C  1.120881 -2.060303 0.69812
C  -1.802924 3.752118 -0.082312
C  2.429403 -2.459424 0.532408
C  4.139327 0.732956 -0.586325
C  4.801746 -1.958482 -0.068404
C  -6.767715 -3.235549 -0.660295
C  5.461529 0.289284 -0.747755
C  5.799682 -1.067343 -0.486962
H  -3.199482 -0.215119 1.751371
H  -4.411775 1.010182 1.340245
H  -3.167906 -0.972059 -0.682252
H  -4.381797 0.261226 -1.064727
H  -4.792337 -2.058435 0.949541
H  -6.00797 -0.828089 0.546422
H  -1.350325 -1.058323 0.946888
H  1.991608 2.373098 -0.521098
H  -3.821688 3.112749 0.462823
H  -4.775788 -2.837545 -1.457561
H  -5.978828 -1.601015 -1.870868
H  0.27806 4.099815 -0.578573
H  0.356883 -2.776214 1.0238
H  -2.108229 4.790327 -0.253054
H  2.724426 -3.497888 0.724123
H  3.910427 1.782345 -0.796364
H  5.048079 -3.007495 0.135576
H  -7.649088 -2.683936 -0.281839
H  -7.095207 -3.844316 -1.52304
H  -6.439371 -3.928884 0.137172
H  6.235692 0.991287 -1.076477
H  6.8322 -1.410443 -0.613476
