program: Gaussian 09
title: 000044215
version: EM64L-G09RevD.01
frameworkgroup: C1[X(C8H7ClO4)]
method: RPBEPBE
basis: SDD
operation: Freq
keyword: #p
keyword: freq=noraman
keyword: PBEPBE/SDD
title: #p freq=noraman PBEPBE/SDD
converged: YES YES NO NO
title: Mulliken charges:
elementType: Cl O O O O C C C C C C C C H H H H H H H
charge: -0.057063 -0.283698 -0.418219 -0.439670 -0.251442 0.290746 0.303564 -0.463490 0.287568 -0.410789 -0.227622 0.113459 -0.515999 0.302026 0.297082 0.236500 0.216513 0.265661 0.367706 0.387166
chargesum: 0.00000
title: Mulliken charges with hydrogens summed into heavy atoms:
elementType: Cl O O O O C C C C C C C C
charge: -0.057063 -0.283698 -0.050513 -0.052505 -0.251442 0.290746 0.303564 -0.161464 0.287568 -0.113707 -0.227622 0.113459 0.202675
polarizability: 1.62063576e+02 -8.15821776e-01 1.36981103e+02 -1.33229594e+00 1.81039684e+00 4.85968114e+01
1716.lowfreq: -5.5980 -2.8582 0.0015 0.0019 0.0026 7.2406 57.0538 63.3796 96.6738
frequency: 57.0433 63.3734 96.6722 111.5252 143.1823 158.9848 190.1518 234.1083 292.7197 305.8819 329.6904 346.0618 360.2191 417.7494 476.1893 509.7331 518.1211 546.6288 592.2467 606.7711 618.6916 723.8550 734.4502 737.8379 790.2334 870.5256 899.8220 923.3456 989.1440 1044.2240 1086.3641 1112.3842 1147.1761 1156.9288 1209.9508 1239.0984 1279.3886 1329.9554 1398.7166 1409.2552 1441.7544 1456.3638 1475.9189 1478.9735 1568.9480 1607.2199 1641.1592 2985.5488 3098.0614 3138.7925 3180.4196 3193.2625 3468.1730 3534.8332
redmass: 3.0659 4.6344 5.1752 2.8660 6.6030 2.2351 4.9903 4.8267 4.7862 6.9640 8.2276 12.1075 5.4669 7.9983 1.1088 5.8471 3.3803 3.5599 4.9957 1.7850 3.1892 8.5659 4.5956 5.0220 7.2488 7.9769 1.4113 1.5082 7.7446 2.7796 2.1311 1.2362 1.5220 1.3919 2.0459 2.0513 1.7214 4.3159 2.8830 5.4670 1.3505 1.1015 1.8829 1.5405 7.0290 7.6253 8.7180 1.0345 1.0975 1.1053 1.0931 1.0927 1.0646 1.0642
irintensity: 2.8064 4.3789 0.5329 0.5101 0.5396 2.4441 2.7702 2.0829 2.2907 5.5837 4.4699 1.1038 5.8560 4.3219 142.4924 24.8332 20.1445 40.2478 72.1363 70.3283 27.0840 11.9173 36.8583 38.8753 55.7195 8.9671 12.5310 25.0824 87.1120 205.9166 141.4852 5.2504 71.2547 14.0682 34.8461 317.3804 14.7202 305.7825 38.2138 1.8740 9.7508 20.4500 98.2760 6.7776 113.2862 31.6368 274.6816 73.2522 32.6857 11.9816 5.4187 2.9680 87.3358 52.4865
temp: 298.150 k
press: 1.00000 atm
elementType: 17 8 8 8 8 6 6 6 6 6 6 6 6 1 1 1 1 1 1 1
symmnumber: 1
zpe: 360840.6 jmol-1
zpe.correction: 0.137437 hartree
zpe.thermalcorrener: 0.150093 hartree
zpe.thermalcorrenthalpy: 0.151037 hartree
zpe.thermalcorrgfe: 0.097703 hartree
zpe.sumelectzpe: -1069.041730 hartree
zpe.sumelectthermal: -1069.029074 hartree
zpe.sumelectthermalent: -1069.028130 hartree
zpe.sumelectthermalfe: -1069.081464 hartree
dipole: 2.1371 -1.1861 1.0378
dipole: 2.6554
quadrupole: -72.5261 -81.5824 -83.3305
quadrupole: 6.6026 2.7340 -3.8092
quadrupole: 6.6202 -2.4360 -4.1842 6.6026 2.7340 -3.8092
hfenergy: -1069.1791667 hartree
pointgroup: C01 [X(C8H7Cl1O4)]
dipole: 0.8453309 -0.4006639 0.4650617 debye
dipolederiv: -0.2684912 -0.2298116 -0.0215251 -0.216807 -0.6736625 -0.0514829 -0.0259929 -0.0578196 -0.0565588 -1.0256385 0.6834023 -0.1211469 0.6674562 -0.9322369 0.1424587 0.023568 -0.0656359 -0.3417383 -1.4080752 -0.2619066 -0.0213812 -0.2476955 -0.2467446 0.0106728 -0.0132548 0.0246539 -0.3664443 -0.6152429 -0.4107455 -0.0515256 -0.6028222 -1.0980149 -0.0951713 -0.0634514 -0.0803721 -0.433935 -1.1463345 0.2361228 -0.0213165 0.2518209 -0.7225725 -0.025284 -0.0083976 -0.0241034 -0.3351775 0.3732261 -0.54135 -0.0413226 -1.0559502 0.8908218 -0.1013597 -0.1931261 0.1187265 0.0133169 -0.8695667 -0.2230828 -0.059439 -0.0491997 0.0299154 -0.0021543 -0.0484991 -0.004948 -0.0126162 0.0880761 0.2711462 0.006229 -0.1098833 -0.0829624 0.0279621 -0.0263012 0.0771591 -0.1208856 1.1740004 0.0793602 0.0001611 0.3706884 -0.2649795 -0.0002972 0.0461672 -0.0716845 0.0587664 0.0123887 0.0102862 0.0003093 0.1093506 -0.2372067 0.0055009 0.0128809 0.0012584 -0.0779077 0.0004661 0.3321545 0.0310052 0.5372074 0.9637208 0.0954291 0.0627527 0.0878302 -0.0652156 2.1533853 0.1942112 0.11534 0.2876811 1.3858276 0.1269426 0.1046495 0.1076869 0.2470692 0.669909 -0.3939766 0.1431613 -0.1014565 0.269899 -0.0744564 0.2196874 -0.1935388 0.4100576 0.1407376 -0.0224373 0.0016318 -0.0178677 0.0430971 -0.0103813 -0.0018571 -0.007644 0.1687567 0.1284762 0.0546583 0.0037306 0.0211816 0.0768597 -0.0085228 -0.0017747 -0.0150977 0.172219 0.047782 0.0836495 -0.0181228 0.1314079 -0.1148227 -0.0294264 -0.0091589 -0.0420257 0.0854825 -0.0221625 0.0523926 0.0744244 -0.0012043 0.0939656 -0.024357 -0.0564123 0.0967214 -0.1785473 -0.0380896 -0.031705 -0.0139744 -0.1569764 0.0782677 0.0142635 -0.0211822 0.0581181 0.0630257 0.4381301 0.0506171 -0.001983 0.0315733 0.2176647 -0.0010819 -0.0039261 -0.0056347 0.3688932 0.1670233 0.0670145 -0.0042556 0.1514954 0.3231632 0.0007456 0.0036286 -0.0036501 0.4014389 unknown
polarizability: 161.5235808|1.1528676|136.8625902|7.5133797|4.3948397|49.2553187 unknown
InChI: InChI=1S/C8H7ClO4/c1-13-6-3-4(8(11)12)2-5(9)7(6)10/h2-3,10-11H,1H3
charge 0 multiplicity 1
20 atoms
Cl 1.279248 3.116141 0.319813
O  1.656562 -2.121456 -0.18741
O  2.815302 0.51657 0.088755
O  -3.260525 -1.48838 -0.269974
O  -3.687559 0.786972 -0.074901
C  0.886675 -0.965426 -0.040738
C  -1.380342 -0.009195 -0.053203
C  -0.512202 -1.125788 -0.11211
C  1.433205 0.350989 0.081119
C  -0.854171 1.3007 0.092506
C  0.532391 1.444764 0.158407
C  -2.855339 -0.151775 -0.127971
C  2.830476 -2.324533 0.692263
H  -0.915487 -2.13513 -0.218342
H  -1.53223 2.156123 0.147028
H  3.188806 -3.333629 0.440671
H  2.524252 -2.287098 1.754865
H  3.609182 -1.571652 0.496658
H  3.03777 1.48574 0.148926
H  -4.253412 -1.516538 -0.317862
