program: Gaussian 09
title: 000005163
version: EM64L-G09RevD.01
frameworkgroup: C1[X(C17H16N4O)]
method: RPBEPBE
basis: SDD
operation: Freq
keyword: #p
keyword: freq=noraman
keyword: PBEPBE/SDD
title: #p freq=noraman PBEPBE/SDD
converged: NO YES NO NO
title: Mulliken charges:
elementType: O N N N N C C C C C C C C C C C C C C C C C H H H H H H H H H H H H H H H H
charge: -0.289675 -0.266361 -0.164741 -0.510724 -0.000726 0.244425 -0.557266 0.254771 -0.436520 0.217089 -0.511014 0.360131 -0.498027 -0.421190 0.231333 -0.239821 -0.635099 0.468855 -0.362767 -0.420052 -0.154343 -0.363395 0.239637 0.239422 0.237966 0.238294 0.240911 0.315628 0.258123 0.249080 0.236325 0.232177 0.236338 0.323054 0.221995 0.318509 0.227717 0.239941
chargesum: 0.00000
title: Mulliken charges with hydrogens summed into heavy atoms:
elementType: O N N N N C C C C C C C C C C C C C C C C C
charge: -0.289675 -0.266361 -0.164741 -0.187669 -0.000726 0.244425 -0.078207 0.254771 0.039740 0.217089 -0.270104 0.360131 -0.182399 -0.163067 0.231333 0.009260 0.069741 0.468855 -0.140772 -0.101544 0.073374 -0.123455
polarizability: 3.89629382e+02 1.23629930e+01 2.22957013e+02 1.65828363e-03 -6.44734512e-02 9.44951231e+01
1716.lowfreq: -9.5552 -4.0561 -3.2869 -0.0006 0.0004 0.0006 12.8552 27.6567 53.4751
frequency: 11.5306 27.6507 53.3777 58.0475 62.7508 71.8734 104.9878 130.6286 150.4258 176.1583 189.4003 215.3632 237.5478 248.4238 297.7209 343.0930 377.7006 378.5484 405.0324 418.3401 418.6320 475.2898 497.9455 500.3775 565.1063 590.3163 597.6265 612.9652 628.0714 660.7663 691.8667 694.8964 714.8086 725.0899 728.5634 770.9510 772.9637 790.7278 805.5043 812.9004 834.8870 839.3740 849.5585 871.3355 898.6570 918.6357 944.5000 959.0522 965.0660 990.8435 993.7973 1007.7191 1030.3363 1053.6586 1066.8893 1084.7032 1114.3443 1118.8503 1120.1683 1130.6712 1181.5473 1183.5126 1194.4617 1214.4813 1239.1123 1243.4558 1256.2065 1269.1525 1282.6500 1305.1455 1319.1405 1326.7612 1339.8806 1359.2518 1391.4666 1406.9886 1414.4254 1433.8352 1458.0553 1465.7772 1468.8116 1484.3155 1486.6627 1493.3909 1499.5626 1505.8058 1513.8049 1565.9773 1583.4487 1588.3025 1621.5754 1637.0148 2960.2604 2972.7530 2999.2383 3007.5121 3047.3983 3050.0108 3104.9685 3108.9878 3133.4023 3136.8835 3161.5466 3198.0688 3200.5205 3207.7722 3233.7798 3532.1327
redmass: 3.9673 5.1075 2.1935 1.1582 5.7741 4.5008 3.4357 3.9471 3.5948 4.8551 5.2407 3.7706 4.4866 4.5423 4.2388 7.0806 5.7412 6.0301 3.2691 2.9264 4.7946 4.0929 6.4124 2.5298 1.4302 3.8110 6.8220 6.6641 4.9364 4.2412 5.6385 9.3979 2.0058 6.5141 1.5863 6.1795 2.5159 6.9106 1.7694 3.9052 1.3467 7.3719 1.3182 1.3633 1.3459 1.4236 1.3905 5.2101 1.3815 2.6912 2.8272 2.9509 2.8460 1.6383 2.6427 1.1847 2.7818 1.3050 1.6248 4.8836 2.1128 1.1533 1.2950 1.6903 1.0843 1.9687 2.1973 1.8352 2.1393 2.3047 5.1604 1.3903 1.8405 4.2568 4.2247 2.5760 3.2750 1.5170 2.4667 1.0416 1.1312 1.6166 1.5124 2.3188 2.4453 1.7836 3.8542 4.1181 7.3942 5.7088 5.0982 7.7568 1.0566 1.0358 1.0604 1.1074 1.1018 1.1044 1.0982 1.0898 1.0892 1.0921 1.0995 1.0936 1.0935 1.0904 1.1065 1.0754
irintensity: 5.5214 0.0014 0.3488 0.3300 0.7090 0.0141 2.1911 6.3638 1.1563 2.4418 0.7159 0.0028 3.6837 2.0638 0.0003 4.1537 3.2720 0.8053 3.0371 10.1904 0.6671 9.7019 4.5641 21.6797 38.8507 0.6290 5.0399 4.8337 1.0050 0.6540 0.7016 21.1388 40.4189 4.6634 50.2161 25.7002 20.9752 7.7282 57.8874 3.0703 11.0771 3.4745 0.0505 16.2880 0.0985 36.3859 15.3491 4.0862 0.2373 9.4289 9.0893 0.5575 5.1146 2.4561 1.2980 19.4739 40.6234 0.5797 10.0616 24.9998 0.4660 0.2294 3.0193 5.2539 0.1448 5.4817 135.4435 1.0025 177.2885 20.2629 462.2663 88.2026 0.4289 23.0114 22.1081 495.7830 20.3312 49.2870 127.7062 14.5232 10.2993 11.7067 45.8533 592.7670 10.8851 93.2012 7.6515 82.3297 9.3646 63.3072 256.9852 33.6633 42.0189 92.5677 57.8555 13.6655 29.1835 30.5432 12.3199 17.6250 12.9195 13.5844 36.8774 2.2018 3.1037 0.2560 5.3392 5.9919
temp: 298.150 k
press: 1.00000 atm
elementType: 8 7 7 7 7 6 6 6 6 6 6 6 6 6 6 6 6 6 6 6 6 6 1 1 1 1 1 1 1 1 1 1 1 1 1 1 1 1
symmnumber: 1
zpe: 787120.3 jmol-1
zpe.correction: 0.299798 hartree
zpe.thermalcorrener: 0.318441 hartree
zpe.thermalcorrenthalpy: 0.319385 hartree
zpe.thermalcorrgfe: 0.250206 hartree
zpe.sumelectzpe: -950.116547 hartree
zpe.sumelectthermal: -950.097904 hartree
zpe.sumelectthermalent: -950.096960 hartree
zpe.sumelectthermalfe: -950.166139 hartree
dipole: -4.3532 7.8983 -0.0198
dipole: 9.0185
quadrupole: -98.6440 -120.5837 -134.2960
quadrupole: 17.3778 -0.0651 0.0105
quadrupole: 19.1973 -2.7425 -16.4548 17.3778 -0.0651 0.0105
hfenergy: -950.4163455 hartree
pointgroup: C01 [X(C17H16N4O1)]
dipole: 1.7076745 3.1101691 0.0068818 debye
polarizability: 389.6686686|-12.0951671|222.917743|-0.0379262|0.0379592|94.4951057 unknown
InChI: InChI=1S/C17H16N4O/c1-20-7-4-12-10-16-13(9-15(12)20)5-8-21(16)17(22)19-14-3-2-6-18-11-14/h2-4,6-7,9-11,19H,5,8H2,1H3
charge 0 multiplicity 1
38 atoms
O  -1.269201 -1.300523 -0.00543
N  -0.233399 0.805531 -0.002627
N  5.220379 -0.427858 0.00041
N  -2.581717 0.658182 0.001284
N  -5.435457 -1.795934 -0.003125
C  1.997415 1.496361 -0.0034
C  1.184064 2.782463 -0.006859
C  1.130545 0.357525 -0.002348
C  -0.298937 2.297672 0.000596
C  3.895271 0.03005 -0.000836
C  3.390596 1.353376 -0.002635
C  3.029055 -1.124722 -0.000097
C  1.616487 -0.962032 -0.000975
C  3.886237 -2.290307 0.00166
C  -1.349857 -0.035322 -0.002499
C  5.203265 -1.833034 0.001925
C  6.408277 0.425136 -0.00024
C  -3.882428 0.098077 0.001069
C  -4.986749 0.995351 0.005131
C  -4.163625 -1.302316 -0.003006
C  -6.297931 0.483229 0.005043
C  -6.480829 -0.918996 0.000848
H  1.39561 3.397463 -0.900592
H  1.401642 3.407337 0.878442
H  -0.838916 2.661381 -0.895836
H  -0.828395 2.65767 0.904908
H  4.049711 2.228495 -0.003483
H  0.929611 -1.808807 -0.000676
H  3.571043 -3.332001 0.002647
H  6.135884 -2.395798 0.003065
H  6.435238 1.072096 0.896877
H  7.311433 -0.205725 0.001134
H  6.436156 1.069506 -0.899195
H  -2.553311 1.679181 0.005073
H  -4.817575 2.080307 0.008277
H  -3.345631 -2.023663 -0.006196
H  -7.161398 1.156351 0.008147
H  -7.482962 -1.3617 0.00062
