program: Gaussian 09
title: 000044299
version: EM64L-G09RevD.01
frameworkgroup: C1[X(C24H16N4O2)]
method: RPBEPBE
basis: SDD
operation: Freq
keyword: #p
keyword: freq=noraman
keyword: PBEPBE/SDD
title: #p freq=noraman PBEPBE/SDD
converged: YES YES NO NO
title: Mulliken charges:
elementType: O O N N N N C C C C C C C C C C C C C C C C C C C C C C C C H H H H H H H H H H H H H H H H
charge: -0.204038 -0.202541 -0.035792 -0.037463 -0.085736 0.024393 0.270677 0.305367 -0.246146 0.261252 0.249478 -0.076208 0.433262 -0.409551 -0.654347 -0.511268 -0.364961 -0.382721 -0.326576 -0.433476 -0.265500 -0.238959 -0.232975 -0.240357 0.175566 -0.316559 -0.249998 0.385756 -0.337661 -0.333842 0.260875 0.245723 0.246378 0.236507 0.233047 0.288031 0.266540 0.242900 0.230153 0.231994 0.235027 0.230599 0.264525 0.287746 0.291399 0.289478
chargesum: 0.00000
title: Mulliken charges with hydrogens summed into heavy atoms:
elementType: O O N N N N C C C C C C C C C C C C C C C C C C C C C C C C
charge: -0.204038 -0.202541 -0.035792 -0.037463 -0.085736 0.024393 0.270677 0.305367 -0.246146 0.261252 0.249478 -0.076208 0.433262 -0.148676 -0.162245 -0.274761 -0.131914 -0.094690 -0.060035 -0.190576 -0.035347 -0.006964 0.002052 -0.009757 0.175566 -0.052034 0.037748 0.385756 -0.046262 -0.044364
polarizability: 4.58623074e+02 -6.03117414e+00 4.34956591e+02 3.26481762e+01 -2.48495171e+01 2.05460506e+02
1716.lowfreq: -4.3949 -1.3548 0.0005 0.0009 0.0010 5.0608 12.7615 18.6133 20.0903
frequency: 12.2794 18.5939 20.0661 53.7784 63.6899 65.2199 66.1744 95.0935 104.6573 155.0064 158.8634 172.7621 190.4865 211.2118 227.5509 272.6733 292.4440 308.9537 329.0031 334.7419 350.4838 376.3814 411.5190 416.5519 426.2696 436.5368 454.3415 487.7828 505.2580 510.5339 516.7761 520.7006 527.8198 546.0177 564.3600 581.5475 585.8093 621.1966 635.5179 647.9488 663.2075 670.9227 682.9996 708.3723 746.6902 751.8398 765.3144 768.6536 772.9573 782.3235 783.9341 825.5686 832.4760 846.8988 855.1605 856.2923 877.0473 883.6442 886.3737 902.4604 924.3873 951.3518 965.0003 973.4980 989.8989 996.1381 996.3704 998.2623 1008.2991 1009.0197 1018.0294 1027.4615 1053.3952 1062.0713 1089.4197 1102.0058 1102.6641 1142.0956 1146.6498 1154.3842 1168.7428 1177.7012 1180.8913 1204.0182 1216.5652 1233.1591 1239.1863 1245.0095 1266.8706 1283.9992 1310.3335 1316.0827 1327.6142 1336.8747 1364.4032 1371.4136 1398.1989 1404.1083 1407.8452 1416.9620 1421.5099 1429.6158 1446.0426 1450.0390 1464.2308 1472.6528 1489.4024 1496.2924 1535.8584 1553.9210 1558.8650 1590.1287 1603.6908 1607.3497 1615.8798 1629.7938 3009.6066 3074.3338 3123.6615 3125.7681 3132.2564 3138.0123 3145.0055 3155.3997 3157.3456 3159.4822 3165.2852 3167.2750 3172.7619 3173.4376 3186.3481 3190.7347
redmass: 7.0097 5.6131 6.7615 7.0228 6.3955 5.0180 6.3746 6.3833 5.0822 5.3573 4.7728 8.7227 5.6743 6.8405 8.0686 5.1646 5.0786 5.6693 5.2673 6.3812 6.7904 5.5948 3.0207 3.4941 3.4126 3.4442 5.2198 5.5193 4.4928 3.8651 5.0192 5.1726 3.8036 4.1120 5.1079 6.8897 3.5615 7.0801 6.4708 6.4573 5.0992 5.5659 5.3846 3.3530 5.0758 5.4081 1.7378 1.9220 2.0616 3.2848 3.4552 2.0978 5.1567 2.0942 1.2492 4.8083 1.8995 1.7113 5.3162 1.6537 3.7244 5.8955 1.3793 1.3534 1.3763 1.3323 1.3547 2.7917 1.3474 1.3639 2.3687 2.3674 3.3111 2.5019 3.3815 1.2777 2.1282 1.5849 1.5552 1.4006 1.1196 1.3927 1.3603 1.7936 6.2983 1.9706 1.8179 1.6500 1.9949 1.2798 1.3508 2.8687 2.6549 3.4607 8.0005 3.8590 5.1914 5.7974 10.2340 2.5379 3.7558 4.6586 3.9062 2.7211 2.3871 1.8971 2.1316 1.8987 6.5358 6.8466 7.2190 7.6363 6.8993 6.1945 6.3057 6.6971 1.0584 1.1024 1.0871 1.0871 1.0852 1.0904 1.0890 1.0961 1.0960 1.0955 1.0899 1.0888 1.1000 1.0973 1.0962 1.0965
irintensity: 0.2526 0.0776 0.2599 0.8410 0.7336 1.7178 0.6217 0.8301 0.5601 2.7922 2.1784 1.7368 3.7117 1.2149 5.9934 0.3065 0.4926 0.9896 1.3051 5.7305 1.4016 0.6696 0.2472 10.0644 3.4244 6.3997 2.4370 4.1316 7.0609 0.5283 0.8535 0.8013 6.1960 3.5775 3.5470 4.3727 9.3165 0.4641 1.4870 6.3614 14.5086 7.6178 8.2106 9.0846 2.0024 4.0398 15.5085 98.8237 35.9146 18.3212 12.7563 18.8474 0.8649 49.9052 1.6680 1.4876 2.2374 63.4065 8.2171 2.6799 9.1086 13.0014 1.1965 2.8735 1.2354 1.0197 0.3932 6.1257 0.7775 0.0900 7.6661 9.2267 4.4221 5.0996 22.6120 16.8502 0.7338 0.3354 4.1218 3.5820 1.8565 58.3090 15.0349 45.8392 408.2895 10.7304 4.5529 1.9759 0.3476 0.2896 0.8235 1.3091 1.7255 15.8969 85.8441 14.5846 91.2427 15.5252 6.3306 5.2843 26.5887 23.8758 15.0271 4.1006 4.2076 12.5896 60.8515 6.2731 15.0103 6.3908 2.0505 8.0636 32.1433 1.2821 3.7440 0.8027 29.7929 8.5919 0.1060 7.5816 0.3826 15.1652 12.1130 8.8418 38.8080 22.9743 1.5260 1.9145 32.7456 21.7749 0.2156 0.9541
temp: 298.150 k
press: 1.00000 atm
elementType: 8 8 7 7 7 7 6 6 6 6 6 6 6 6 6 6 6 6 6 6 6 6 6 6 6 6 6 6 6 6 1 1 1 1 1 1 1 1 1 1 1 1 1 1 1 1
symmnumber: 1
zpe: 899365.1 jmol-1
zpe.correction: 0.342550 hartree
zpe.thermalcorrener: 0.365551 hartree
zpe.thermalcorrenthalpy: 0.366495 hartree
zpe.thermalcorrgfe: 0.286961 hartree
zpe.sumelectzpe: -1291.484908 hartree
zpe.sumelectthermal: -1291.461907 hartree
zpe.sumelectthermalent: -1291.460963 hartree
zpe.sumelectthermalfe: -1291.540497 hartree
dipole: -3.5832 1.0580 2.6893
dipole: 4.6033
quadrupole: -214.4216 -146.5637 -171.3310
quadrupole: 6.7989 20.4314 -4.0456
quadrupole: -36.9828 30.8750 6.1078 6.7989 20.4314 -4.0456
hfenergy: -1291.8274579 hartree
pointgroup: C01 [X(C24H16N4O2)]
dipole: 1.325593 0.7245686 -0.9989327 debye
polarizability: 457.7102235|6.1629593|425.9351924|25.5582823|56.917398|215.3947551 unknown
InChI: InChI=1S/C24H16N4O2/c29-28(30)18-12-10-17(11-13-18)27-25-15-22-20-7-3-4-8-23(20)26-24-19-6-2-1-5-16(19)9-14-21(22)24/h1-14H,15H2
charge 0 multiplicity 1
46 atoms
O  -7.365942 -2.621885 0.391627
O  -7.091483 -1.184045 2.141909
N  3.438129 1.03137 0.745716
N  -1.385396 1.305594 -0.976785
N  -1.978603 0.278756 -1.503355
N  -6.725813 -1.686511 1.010114
C  1.704252 0.175115 -0.79664
C  1.077923 1.453304 -0.837963
C  2.905367 0.015795 0.017464
C  1.606082 2.518308 -0.037729
C  3.584471 -1.285418 0.064605
C  2.813561 2.254675 0.734603
C  3.048841 -2.389516 -0.681386
C  1.202869 -0.976699 -1.524759
C  -0.13971 1.677056 -1.727227
C  1.845918 -2.196703 -1.465685
C  1.018363 3.82798 0.054601
C  4.764186 -1.474422 0.838329
C  3.391573 3.302386 1.527893
C  3.709246 -3.653449 -0.631514
C  1.599718 4.822692 0.839955
C  5.400333 -2.725414 0.874612
C  2.801142 4.562783 1.579168
C  4.871036 -3.822276 0.136317
C  -3.169453 -0.150085 -0.802472
C  -3.899235 -1.182537 -1.443933
C  -3.607151 0.37638 0.444998
C  -5.491029 -1.153736 0.378937
C  -5.072345 -1.691848 -0.857474
C  -4.774109 -0.127748 1.040455
H  0.282592 -0.883039 -2.109075
H  -0.237716 2.747342 -1.974918
H  -0.067164 1.104097 -2.669322
H  1.444499 -3.054065 -2.019376
H  0.086286 4.046288 -0.475441
H  5.151187 -0.618457 1.397948
H  4.302273 3.062894 2.085035
H  3.295225 -4.493371 -1.201856
H  1.133089 5.812015 0.900583
H  6.30757 -2.860486 1.473442
H  3.245409 5.357765 2.18771
H  5.371919 -4.795981 0.170054
H  -3.528093 -1.567265 -2.398658
H  -3.019868 1.166868 0.921072
H  -5.658662 -2.485573 -1.326636
H  -5.142487 0.247666 1.998758
