program: Gaussian 09
title: 000044160
version: EM64L-G09RevD.01
frameworkgroup: C1[X(C9H12N2O)]
method: RPBEPBE
basis: SDD
operation: Freq
keyword: #p
keyword: freq=noraman
keyword: PBEPBE/SDD
title: #p freq=noraman PBEPBE/SDD
converged: YES YES NO NO
title: Mulliken charges:
elementType: O N N C C C C C C C C C H H H H H H H H H H H H
charge: -0.288434 -0.049122 0.051063 0.486823 -0.525895 -0.520915 0.454142 -0.443738 -0.402070 -0.206684 -0.806851 -0.626470 0.219727 0.257197 0.252465 0.232293 0.234691 0.227230 0.230495 0.238808 0.224187 0.254167 0.270722 0.236169
chargesum: 0.00000
title: Mulliken charges with hydrogens summed into heavy atoms:
elementType: O N N C C C C C C C C C
charge: -0.288434 -0.049122 0.051063 0.486823 -0.048972 -0.268450 0.454142 -0.211445 -0.167379 0.020546 -0.113361 0.134588
polarizability: 1.44181025e+02 1.00032603e+01 1.24781031e+02 -9.66265943e+00 -2.33349756e+00 7.36583282e+01
1716.lowfreq: -14.8087 -0.0004 0.0002 0.0006 4.6319 9.4140 13.0364 30.4297 41.2542
frequency: -10.7716 30.3791 41.2223 71.6154 95.7104 196.4330 208.3485 224.4262 291.7116 332.0632 352.4095 384.0996 398.4215 435.9208 505.4894 525.5987 592.0167 683.1772 719.2024 730.5155 794.9592 817.8161 894.5777 903.8485 924.7025 939.6399 976.7225 985.0463 990.0482 1005.8021 1049.0365 1096.1445 1102.3964 1135.0013 1164.2808 1183.7527 1250.5192 1265.2104 1293.6569 1310.0310 1335.1006 1360.6148 1382.5696 1398.1724 1405.4005 1431.9826 1457.6643 1467.0126 1472.8612 1473.6395 1477.8288 1485.6983 1600.5230 1618.5881 2977.4760 2980.9098 2986.6179 3050.2124 3059.1713 3071.4687 3087.1047 3100.4808 3114.7766 3117.4079 3126.3430 3153.6178
redmass: 1.0166 3.6775 5.5382 2.5722 1.2147 3.5886 4.0168 3.4942 5.8201 2.9164 3.3872 3.9900 2.6389 2.8898 4.1262 4.3917 5.3818 3.7864 2.4094 3.6259 1.6702 4.3142 1.9485 1.3119 2.0987 2.1757 1.9795 1.3529 5.7214 1.5461 1.5769 1.5020 1.3981 1.6568 1.6715 1.0960 3.5718 3.9421 1.5791 1.5580 1.7041 2.6095 5.5704 1.2256 1.2758 2.1196 1.0946 1.0893 1.2990 1.1401 1.0499 1.7558 5.9215 6.0830 1.0385 1.0338 1.0593 1.1006 1.0953 1.1009 1.1000 1.0999 1.0899 1.0882 1.0916 1.0991
irintensity: 0.5524 2.0822 4.7323 0.2829 0.6814 6.2252 2.3486 2.0408 2.7511 3.4425 2.9139 2.5783 1.3517 7.7276 1.7884 0.1914 5.9443 1.0284 35.7208 10.5794 28.4837 22.1514 43.9830 1.0923 0.8576 89.4907 93.1510 0.2418 1.5523 2.5866 17.1908 5.8113 1.9625 10.7025 9.0585 0.7041 13.0181 7.7993 17.7007 69.6506 49.8222 58.8701 0.2512 13.6393 38.3026 0.7215 15.0013 20.0069 11.0521 10.7745 24.7464 15.6456 6.3073 17.4221 28.4802 22.1137 35.0712 6.7261 20.1639 20.6177 16.3228 2.5623 6.7953 3.8498 24.1080 27.3715
temp: 298.150 k
press: 1.00000 atm
elementType: 8 7 7 6 6 6 6 6 6 6 6 6 1 1 1 1 1 1 1 1 1 1 1 1
symmnumber: 1
zpe: 508982.3 jmol-1
zpe.correction: 0.193861 hartree
zpe.thermalcorrener: 0.205380 hartree
zpe.thermalcorrenthalpy: 0.206324 hartree
zpe.thermalcorrgfe: 0.154820 hartree
zpe.sumelectzpe: -533.926918 hartree
zpe.sumelectthermal: -533.915399 hartree
zpe.sumelectthermalent: -533.914455 hartree
zpe.sumelectthermalfe: -533.965958 hartree
dipole: -3.6024 -2.6087 1.0167
dipole: 4.5625
quadrupole: -81.0503 -66.6884 -72.1300
quadrupole: -11.2206 1.2306 0.2262
quadrupole: -7.7608 6.6012 1.1596 -11.2206 1.2306 0.2262
hfenergy: -534.1207787 hartree
pointgroup: C01 [X(C9H12N2O1)]
dipole: -1.1585023 1.231074 -0.6036617 debye
dipolederiv: -0.8051254 0.5960788 -0.1701348 0.5042716 -0.7145128 0.2103456 0.4105111 -0.3784391 -0.1864194 -0.5518065 0.1890387 -0.0920934 0.4249548 -0.6326854 0.0492389 -0.3299222 0.3059606 -0.2668374 0.5909121 -0.8028873 0.24626 -0.9662073 1.0060049 -0.3800262 0.1095784 -0.10778 -0.012444 0.1262695 -0.0143212 0.0791591 -0.0124298 -0.0198193 -0.0571106 0.1420484 -0.0642198 -0.0217664 0.5974962 -0.0906183 0.0214936 -0.0758081 0.3105334 0.1229053 -0.1993818 0.1873619 0.1353725 -0.2096388 -0.1424812 0.0177891 -0.0795814 -0.0705952 -0.0375056 -0.0151409 -0.0690108 -0.1558099 0.1118779 0.2005222 0.0240765 0.218275 0.3185512 0.0512003 -0.0038402 0.0109326 -0.0255733 -0.1934809 0.0815247 0.0208411 0.0264806 0.01163 0.0176938 0.0313546 0.0232889 -0.1591909 0.0139318 0.0058788 0.099468 -0.0856565 -0.1911279 -0.033858 0.0980304 0.0121325 -0.1329273 0.0132549 -0.059831 0.0790793 -0.0418497 0.094255 -0.0415897 0.0672001 -0.0312543 -0.0897555 -0.0117393 -0.1148977 -0.00913 -0.096403 -0.1074825 -0.0232729 0.0437806 0.0495628 0.0798188 0.0927632 0.1807597 -0.0077762 0.2282859 0.0158607 0.0686879 0.0271376 -0.0301858 0.1207672 -0.0308864 -0.009986 -0.005693 -0.0314559 -0.15337 -0.0676426 0.0448602 0.0028477 0.1015078 0.0083484 0.0045935 -0.0305774 -0.0054628 0.0966485 0.097064 0.0294791 -0.0002905 -0.0340183 0.0936047 0.0695487 -0.0440912 0.0819825 -0.0363307 0.0340549 -0.037852 0.0317261 0.1143236 0.050186 -0.1132713 -0.0481965 -0.0861108 -0.0568778 -0.0258595 -0.0447701 -0.0367548 0.1317977 -0.0799637 -0.0059893 -0.1056595 -0.026697 0.0877136 -0.0128194 -0.1156541 -0.0035362 0.1010467 0.0423953 0.0838963 -0.0519084 0.0859116 -0.0753479 0.0501356 -0.0652049 0.0539331 0.1241964 -0.0127105 0.1352683 0.0357618 0.0518431 -0.0442256 -0.0431244 -0.0071176 -0.0429981 0.0945767 0.0206778 -0.0816123 0.0774121 -0.075796 0.0217562 0.0190523 0.1082012 0.0575535 -0.0443694 -0.0068085 -0.0262724 -0.1231156 0.0218862 0.0602788 0.0408107 -0.139779 -0.0381269 -0.0371808 -0.0044892 -0.029081 -0.1166664 -0.0301832 0.0886805 0.0262817 -0.1130306 0.0610052 0.0052975 0.0557098 0.0309465 0.0836914 0.0967992 0.0756578 -0.0946211 0.0048404 0.0038052 0.1188048 0.0892218 -0.0868071 0.0200103 -0.1270489 -0.0851955 0.0299589 -0.0453285 0.0024862 0.038783 unknown
polarizability: 135.6775762|-11.6766973|128.2580798|19.924457|-5.7137163|78.6847279 unknown
InChI: InChI=1S/C9H12N2O/c1-8-4-3-5-9(6-8)7-11(2)10-12/h3-6H,7H2,1-2H3
charge 0 multiplicity 1
24 atoms
O  3.638597 -1.815971 0.813723
N  2.285273 -0.007056 0.702827
N  2.759236 -1.101667 1.420535
C  -0.104712 0.75249 0.735631
C  1.267205 0.795873 1.404372
C  -0.743186 -0.49037 0.498819
C  -2.023936 -0.560408 -0.102093
C  -0.759439 1.949554 0.360854
C  -2.663017 0.652889 -0.471336
C  -2.038023 1.897485 -0.239652
C  -2.709134 -1.898524 -0.320326
C  2.728135 0.321432 -0.660213
H  1.61546 1.84465 1.476972
H  1.223453 0.378356 2.42761
H  -0.230782 -1.417792 0.78722
H  -0.272324 2.917052 0.535167
H  -3.652696 0.61849 -0.942942
H  -2.542865 2.824926 -0.532431
H  -1.978253 -2.700865 -0.523244
H  -3.284534 -2.199308 0.576724
H  -3.417744 -1.857847 -1.166024
H  1.864569 0.349935 -1.347522
H  3.435578 -0.464592 -0.974125
H  3.236239 1.303365 -0.677345
