program: Gaussian 09
title: 000044267
version: EM64L-G09RevD.01
frameworkgroup: C1[X(C24H20O4)]
method: RPBEPBE
basis: SDD
operation: Freq
keyword: #pfreq=noraman
keyword: PBEPBE/SDD
title: #p freq=noraman PBEPBE/SDD
converged: YES YES NO NO
title: Mulliken charges:
elementType: O O O O C C C C C C C C C C C C C C C C C C C C C C C C H H H H H H H H H H H H H H H H H H H H
charge: -0.266630 -0.246013 -0.257897 -0.261434 0.149905 0.314981 0.148909 0.050286 0.231448 0.262621 0.111409 0.420752 -0.457038 -0.632493 -0.559575 -0.539151 -0.400787 -0.411286 -0.388101 -0.451922 -0.287428 -0.261502 -0.265873 -0.251637 0.305410 0.309806 -0.747748 -0.745783 0.279541 0.286587 0.285912 0.265674 0.242941 0.241462 0.281191 0.266456 0.313681 0.244083 0.234047 0.230753 0.228674 0.231067 0.254025 0.246796 0.246552 0.253984 0.247969 0.245372
chargesum: 0.00000
title: Mulliken charges with hydrogens summed into heavy atoms:
elementType: O O O O C C C C C C C C C C C C C C C C C C C C C C C C
charge: -0.266630 -0.246013 -0.257897 -0.261434 0.149905 0.314981 0.148909 0.050286 0.231448 0.262621 0.111409 0.420752 -0.177497 -0.059994 -0.050960 -0.297689 -0.119595 -0.144830 -0.074420 -0.207839 -0.053382 -0.030749 -0.037199 -0.020570 0.305410 0.309806 -0.000375 0.001543
polarizability: 3.42410265e+02 1.43237414e+01 4.32359530e+02 1.52517336e+01 4.05568278e+00 1.51752708e+02
1716.lowfreq: -8.1306 -5.0576 -0.0004 0.0002 0.0004 1.0159 11.2275 18.8164 28.6738
frequency: 10.6648 18.8115 28.6563 33.5285 39.4662 54.2515 59.8682 71.5555 75.3750 83.8604 115.7375 130.8380 156.1496 175.1096 186.6735 193.6419 205.5032 220.5237 237.6324 295.3028 310.5741 345.5208 362.0809 382.4930 401.9966 407.2381 435.3455 445.0841 458.8653 475.7372 512.3389 520.3206 522.0702 544.3361 558.5296 564.5341 571.1007 585.0245 592.2571 606.8175 614.2015 634.2076 652.8578 687.4375 706.3946 731.0191 759.0939 764.0326 769.2993 780.0105 789.8272 812.0147 816.0865 830.7878 856.4065 876.5518 885.9791 894.7420 899.6355 906.5409 922.7350 969.7717 973.1551 989.4444 990.8719 993.5806 997.1540 1000.1139 1014.0759 1026.0196 1041.9756 1042.5414 1045.9539 1053.9846 1071.2990 1087.1830 1114.3433 1152.6002 1182.7273 1187.0584 1189.6560 1192.2879 1197.4047 1223.3968 1228.3310 1241.5414 1254.9814 1280.0750 1301.5784 1317.3358 1342.7983 1349.4889 1354.4143 1372.0993 1380.3015 1382.6207 1383.5588 1398.0941 1417.5963 1429.6623 1437.1997 1451.9914 1452.0386 1454.3420 1454.7521 1459.2345 1483.6546 1502.1417 1509.0951 1517.5853 1547.8029 1562.1049 1567.2858 1612.9278 1617.0779 1632.3135 1644.2709 1644.7453 3008.2212 3008.8365 3046.2163 3061.5862 3097.0339 3098.7268 3109.5125 3121.9894 3123.1590 3130.1877 3131.7720 3135.3066 3143.4787 3143.7999 3147.4461 3158.2096 3163.0123 3166.0622 3171.7561 3178.7274
redmass: 1.4973 3.1838 2.1198 1.7125 4.7730 7.2205 2.7029 5.5849 3.7193 4.0459 4.5522 4.2247 4.8715 5.1847 6.2603 6.5198 7.1874 5.0067 4.9382 4.9664 5.2135 5.0898 3.7982 2.8634 3.6162 2.8987 3.3295 4.9762 3.3743 3.8245 3.9037 5.6646 3.5933 4.4415 3.4443 3.4830 3.9611 3.9881 4.0253 5.0074 4.6446 5.5336 5.6417 4.7572 3.5457 4.7792 2.6495 1.7363 1.4167 4.2168 4.6586 3.3662 4.5551 1.8848 1.9805 4.1619 3.3314 1.8916 3.3269 4.1798 3.6718 1.3670 1.3775 1.9089 1.5790 1.7148 1.3430 1.4403 2.3476 2.8939 1.7391 1.6984 2.4139 2.1183 2.1370 3.8783 2.4846 1.6472 1.1835 1.2148 2.2596 1.7038 2.2350 1.3011 1.2227 1.9748 1.4995 1.8858 2.0595 2.1653 1.3230 1.3436 3.4964 3.3871 2.6952 1.2611 1.4899 4.7409 2.1822 2.8679 4.8510 1.0628 1.0652 1.0491 1.0498 2.0668 1.9448 2.2338 1.2235 1.4190 5.8704 6.2358 7.7849 5.7718 5.7896 6.4194 8.5817 8.5758 1.0366 1.0368 1.0579 1.0589 1.0975 1.0969 1.1064 1.1041 1.0873 1.0896 1.0858 1.0904 1.1011 1.1014 1.0896 1.0978 1.0946 1.0953 1.0994 1.0952
irintensity: 1.8833 0.0822 0.6699 2.0746 0.6092 0.7337 0.3872 2.4584 1.3426 1.9256 0.7587 0.1662 1.2435 0.5214 2.9942 8.4835 12.1335 4.4420 3.3836 2.1389 2.3873 1.8217 1.4545 0.7883 0.4888 6.8429 10.0430 4.3730 1.7178 6.1074 4.4124 0.7927 3.5896 8.5255 7.6451 7.8148 0.8979 4.5652 3.1722 6.7079 3.8500 1.5919 1.6463 5.2179 9.0996 20.5807 12.6523 6.7990 94.8699 4.0667 3.5072 6.3445 9.7161 47.2816 18.4811 9.2612 138.7248 1.9511 74.2278 136.8388 2.2466 3.0207 4.9149 141.2665 42.6643 27.4779 2.0412 3.2699 11.3381 1.7859 6.0489 8.4729 8.1776 8.9553 0.8071 2.0687 3.0964 3.5639 28.1310 18.7084 383.2434 198.1804 100.0372 51.1429 3.6875 7.9100 3.2998 5.4464 1.1105 5.9863 4.9847 4.6657 0.3579 4.7836 4.5568 73.1579 33.6621 3.2296 4.7851 1.0374 1.2559 12.7551 32.0961 22.8628 19.9590 5.0939 17.9045 28.3352 23.1502 28.2963 0.8319 0.6192 0.2054 3.9542 1.0394 0.2868 247.4360 80.7256 2.2033 2.2396 12.7886 27.2256 6.0490 7.9793 4.9800 2.1052 0.8970 10.3107 3.9518 26.2709 11.4256 10.1718 14.2573 37.2177 7.1430 12.1223 32.1367 15.3340
temp: 298.150 k
press: 1.00000 atm
elementType: 8 8 8 8 6 6 6 6 6 6 6 6 6 6 6 6 6 6 6 6 6 6 6 6 6 6 6 6 1 1 1 1 1 1 1 1 1 1 1 1 1 1 1 1 1 1 1 1
symmnumber: 1
zpe: 984837.4 jmol-1
zpe.correction: 0.375105 hartree
zpe.thermalcorrener: 0.399786 hartree
zpe.thermalcorrenthalpy: 0.400730 hartree
zpe.thermalcorrgfe: 0.316591 hartree
zpe.sumelectzpe: -1225.532925 hartree
zpe.sumelectthermal: -1225.508244 hartree
zpe.sumelectthermalent: -1225.507300 hartree
zpe.sumelectthermalfe: -1225.591439 hartree
dipole: 0.0508 -0.1175 2.0335
dipole: 2.0375
quadrupole: -155.7695 -148.9223 -159.7179
quadrupole: 15.2410 5.6229 -3.0760
quadrupole: -0.9663 5.8809 -4.9147 15.2410 5.6229 -3.0760
hfenergy: -1225.9080296 hartree
pointgroup: C01 [X(C24H20O4)]
dipole: -0.0009038 0.0641162 -0.799036 debye
polarizability: 360.4780019|-38.6205511|414.0462543|-17.6715891|3.6798711|151.9982477 unknown
InChI: InChI=1S/C24H20O4/c1-15(25)27-13-22-19-9-5-6-10-20(19)23(14-28-16(2)26)24-18-8-4-3-7-17(18)11-12-21(22)24/h3-12H,13-14H2,1-2H3
charge 0 multiplicity 1
48 atoms
O  3.090607 1.498271 -0.553788
O  -4.136896 -0.185714 -0.47571
O  3.781303 3.536541 0.364049
O  -4.556281 -2.4730 -0.222217
C  0.502933 -0.607382 0.315152
C  -0.921007 -0.916478 0.480558
C  0.918406 0.7527 0.441657
C  -1.885046 0.128413 0.548618
C  -0.057525 1.81325 0.442622
C  -1.474377 1.496251 0.425405
C  1.434366 -1.732895 0.072542
C  0.988064 -3.083145 0.313015
C  -1.322809 -2.307189 0.627309
C  2.35903 1.125885 0.718713
C  -3.346466 -0.165224 0.812733
C  -0.403587 -3.329801 0.617626
C  0.328271 3.201755 0.447474
C  -2.427136 2.572226 0.335258
C  2.747272 -1.572733 -0.474161
C  1.88496 -4.180192 0.154697
C  -0.622262 4.219088 0.384997
C  -2.015175 3.902269 0.310859
C  3.612191 -2.668223 -0.644111
C  3.197223 -3.980379 -0.295702
C  3.769924 2.722785 -0.587982
C  -4.67166 -1.413958 -0.881934
C  4.451053 2.901921 -1.92719
C  -5.379704 -1.261011 -2.210158
H  -2.381459 -2.554479 0.737838
H  2.437108 1.985812 1.402736
H  2.922078 0.280094 1.139793
H  -3.511659 -1.122372 1.327301
H  -3.815876 0.639498 1.397577
H  -0.729503 -4.365548 0.768219
H  1.384967 3.47926 0.48143
H  -3.492478 2.340996 0.249697
H  3.076348 -0.595752 -0.833085
H  1.518146 -5.192173 0.363557
H  -0.299657 5.265825 0.378285
H  -2.754018 4.707049 0.230352
H  4.608322 -2.505445 -1.07044
H  3.87962 -4.828411 -0.41778
H  3.697866 2.90613 -2.734303
H  5.137976 2.060834 -2.122952
H  5.008551 3.849321 -1.934815
H  -4.639151 -1.052484 -3.002554
H  -6.078095 -0.408268 -2.179632
H  -5.920655 -2.187415 -2.450457
