program: Gaussian 09
title: 000044292
version: EM64L-G09RevD.01
frameworkgroup: C1[X(C27H22N2)]
method: RPBEPBE
basis: SDD
operation: Freq
keyword: #pfreq=noraman
keyword: PBEPBE/SDD
title: #p freq=noraman PBEPBE/SDD
converged: YES YES NO NO
title: Mulliken charges:
elementType: N N C C C C C C C C C C C C C C C C C C C C C C C C C C C H H H H H H H H H H H H H H H H H H H H H H
charge: -0.034985 -0.148627 0.247553 -0.269824 0.312096 0.243968 0.220723 0.422440 -0.090890 -0.422609 -0.502844 -0.354821 -0.388292 -0.378453 -0.439718 -0.330783 -0.351393 -0.244401 -0.262478 -0.243494 0.529462 -0.238744 0.397407 -0.421727 -0.434636 -0.359963 -0.372654 -0.645667 -0.646948 0.267659 0.232598 0.208748 0.287715 0.231901 0.238548 0.261890 0.261666 0.227566 0.224999 0.225637 0.229164 0.223843 0.228538 0.236755 0.238137 0.237247 0.236708 0.218573 0.236601 0.236775 0.219028
chargesum: 0.00000
title: Mulliken charges with hydrogens summed into heavy atoms:
elementType: N N C C C C C C C C C C C C C C C C C C C C C C C C C C C
charge: -0.034985 -0.148627 0.247553 -0.269824 0.312096 0.243968 0.220723 0.422440 -0.090890 -0.154950 -0.270246 -0.146073 -0.100577 -0.146551 -0.201170 -0.068892 -0.089727 -0.016835 -0.037479 -0.017857 0.529462 -0.009580 0.397407 -0.197884 -0.206098 -0.123208 -0.134517 0.046861 0.045456
polarizability: 6.88680560e+02 -7.66377477e+00 4.21403132e+02 1.07145873e+01 -6.51195637e+00 1.52947340e+02
1716.lowfreq: -4.2002 -0.0007 0.0007 0.0007 0.6403 3.7009 23.4465 24.6739 30.1327
frequency: 23.4367 24.6175 30.1035 64.1586 68.2886 71.3158 76.9575 101.4806 108.6128 131.5007 150.6798 160.9386 180.3771 196.2669 198.1225 223.4262 254.7918 280.7503 290.7588 307.3248 322.1126 354.4350 385.4355 394.2795 400.6445 421.6300 423.1302 441.4981 454.5472 479.1327 509.7098 512.1959 513.5275 521.2804 536.9787 559.3760 581.5718 585.8865 606.8610 628.5342 637.1048 649.4353 668.5918 706.3539 720.8066 737.2264 752.1923 765.1115 769.3352 780.2687 796.7003 804.9168 817.7275 823.7210 837.8810 845.8127 858.8970 874.8467 881.0844 899.5214 911.6871 941.7599 941.9302 951.8647 956.3502 962.8491 968.0359 976.9608 991.9691 994.8120 999.6448 1004.9996 1024.2058 1028.7034 1056.6741 1071.4280 1103.7941 1107.3713 1110.3962 1133.5541 1147.5702 1152.9698 1165.1154 1166.5044 1177.1668 1201.7309 1221.9544 1235.3365 1239.7256 1242.1379 1259.6454 1263.8035 1272.1241 1306.7253 1314.5696 1323.0249 1331.7139 1342.6734 1365.9926 1373.0819 1383.3902 1399.1903 1413.2111 1424.8132 1430.2368 1442.3761 1446.6923 1449.2545 1458.5325 1464.1524 1475.1385 1475.4429 1488.6985 1493.4902 1506.2788 1526.4879 1531.7528 1538.4494 1552.4927 1558.2136 1604.7682 1614.2899 1617.2492 1628.1429 1638.3524 2942.1969 2949.5017 3008.9127 3011.4810 3089.5878 3098.2548 3101.0242 3108.1732 3117.6350 3119.5561 3124.1090 3127.7007 3129.0313 3134.3188 3141.2813 3153.9013 3156.5134 3162.5114 3166.3627 3166.8285 3168.7971 3171.0845
redmass: 4.7301 3.7754 4.1340 4.8295 4.4021 4.6886 2.2861 4.5486 1.7486 4.3373 2.7214 3.6487 4.3341 1.1895 3.7573 2.8884 2.6081 3.9976 4.3263 5.1305 4.9636 4.9821 3.8387 4.4056 4.5311 3.1359 3.1743 3.3540 4.9513 3.6501 4.2277 3.1245 3.4122 4.0144 3.2852 5.1563 6.5834 3.5762 5.3358 5.3626 6.4663 6.4026 5.7253 3.5546 4.3326 3.3291 5.2310 1.4178 1.3807 2.6389 3.7954 1.3376 2.1829 2.1696 3.7299 2.0422 1.9983 3.1420 2.5081 1.6916 5.8811 2.9389 1.3873 3.1991 1.5656 1.3694 1.3502 1.3400 1.3261 2.7845 1.2729 1.3448 2.0887 2.1472 1.5007 3.5259 2.1576 1.2375 1.3234 1.5404 1.4574 1.3628 1.2323 1.4937 1.2264 1.1814 1.8193 2.0800 1.4656 1.8465 2.8813 2.0638 2.1194 1.5382 2.2293 2.3800 1.9123 2.2369 3.2655 4.0418 4.0942 3.9071 2.7343 3.9296 1.3030 3.8111 2.7486 2.7600 1.2303 1.0406 2.9085 1.0463 3.7596 1.1064 1.1193 5.5831 2.9195 6.4290 6.0548 7.2645 6.2847 5.8564 5.7668 6.7668 6.0814 1.0368 1.0393 1.0992 1.1030 1.0909 1.0962 1.0858 1.0942 1.0892 1.0864 1.0884 1.0850 1.0879 1.0903 1.0888 1.0961 1.0952 1.0931 1.0941 1.0940 1.1000 1.0970
irintensity: 0.5740 0.1534 0.0675 1.9979 0.3073 0.9983 0.0540 0.1570 4.3231 0.0736 2.3811 0.3705 1.5772 0.4440 1.2431 1.0818 4.6498 1.6398 0.4376 1.1857 2.0894 1.5954 1.6017 4.9260 3.0237 1.7635 3.0084 1.2187 5.4170 1.6779 21.8365 9.5751 3.8751 9.3752 9.4633 4.3297 2.8735 8.8607 11.1300 2.9653 1.1539 8.4915 0.3087 8.0473 4.2764 2.5417 2.2105 15.3914 110.3004 11.3302 7.6482 0.1256 34.7892 46.5475 13.8579 43.1003 15.2108 2.3702 4.8811 6.4801 6.5867 35.9506 8.0268 21.9939 2.3252 0.8525 18.2000 18.3484 0.2227 0.4882 33.3296 1.2182 9.9083 11.7938 25.2618 12.0289 3.1143 0.0143 0.9671 2.1922 3.1139 1.4364 21.6235 4.5908 13.8768 161.4047 10.3163 2.7950 4.8392 3.8204 28.3364 14.4679 6.1642 6.1567 33.8230 21.1114 14.3356 27.6885 296.3010 30.3545 16.6620 19.8952 11.1286 3.6312 12.7008 23.1239 0.0813 19.4150 34.8555 0.0417 48.3719 22.3988 71.2897 4.5722 57.9960 104.2413 346.6743 14.6383 6.7093 92.9335 73.3181 222.5489 403.0899 41.9159 110.7258 99.0779 213.3014 0.0432 83.2210 0.2412 3.7088 41.8427 54.0868 13.7164 0.6437 9.9149 0.3471 8.1943 19.0448 12.4131 44.8562 26.0951 24.6439 23.1040 16.8822 39.3840 28.1850
temp: 298.150 k
press: 1.00000 atm
elementType: 7 7 6 6 6 6 6 6 6 6 6 6 6 6 6 6 6 6 6 6 6 6 6 6 6 6 6 6 6 1 1 1 1 1 1 1 1 1 1 1 1 1 1 1 1 1 1 1 1 1 1
symmnumber: 1
zpe: 1073389.0 jmol-1
zpe.correction: 0.408832 hartree
zpe.thermalcorrener: 0.432694 hartree
zpe.thermalcorrenthalpy: 0.433639 hartree
zpe.thermalcorrgfe: 0.354092 hartree
zpe.sumelectzpe: -1149.619271 hartree
zpe.sumelectthermal: -1149.595409 hartree
zpe.sumelectthermalent: -1149.594465 hartree
zpe.sumelectthermalfe: -1149.674012 hartree
dipole: -7.9718 -0.9103 -0.1845
dipole: 8.0257
quadrupole: -116.8749 -150.4745 -174.3300
quadrupole: 1.0759 3.0979 -4.2506
quadrupole: 30.3516 -3.2480 -27.1035 1.0759 3.0979 -4.2506
hfenergy: -1150.0281038 hartree
pointgroup: C01 [X(C27H22N2)]
dipole: -3.1083911 0.5521114 0.0564082 debye
polarizability: 687.5944452|-12.3944039|408.7156418|-24.8878378|-57.0515709|166.7209452 unknown
InChI: InChI=1S/C27H22N2/c1-29(2)21-15-11-19(12-16-21)13-17-23-24-9-5-6-10-26(24)28-27-22-8-4-3-7-20(22)14-18-25(23)27/h3-18H,1-2H3
charge 0 multiplicity 1
51 atoms
N  3.521504 -1.364907 0.053995
N  -7.225172 1.072297 0.009142
C  1.606262 0.204548 0.179083
C  3.01896 -0.103188 -0.013975
C  0.682583 -0.876385 0.374616
C  3.968438 0.985728 -0.285728
C  1.22081 -2.214761 0.461749
C  3.508496 2.346255 -0.291142
C  2.654412 -2.401044 0.311789
C  1.211975 1.600153 0.222142
C  2.11662 2.619532 0.001235
C  -0.770085 -0.677784 0.513052
C  5.343206 0.715448 -0.540194
C  0.406043 -3.383446 0.651327
C  4.437792 3.397492 -0.55402
C  3.212035 -3.72085 0.407514
C  -1.547575 0.163279 -0.248432
C  6.241391 1.762072 -0.801622
C  0.974831 -4.65497 0.739297
C  5.787284 3.112208 -0.808864
C  -2.993294 0.371578 -0.142015
C  2.393155 -4.827062 0.625339
C  -5.848231 0.848454 -0.041303
C  -3.806762 -0.184009 0.890372
C  -3.654347 1.179902 -1.112713
C  -5.188351 0.041378 0.945864
C  -5.036565 1.417188 -1.075791
C  -7.872057 1.900444 -1.017374
C  -8.032442 0.476267 1.082044
H  0.176528 1.841556 0.475234
H  1.790897 3.665102 0.060266
H  -1.267475 -1.311289 1.260047
H  5.667513 -0.328802 -0.524719
H  -0.682057 -3.279407 0.708234
H  4.081088 4.434552 -0.553669
H  4.296847 -3.813025 0.296238
H  -1.057342 0.716279 -1.06261
H  7.296042 1.541793 -1.000619
H  0.333415 -5.531153 0.88626
H  6.493236 3.925312 -1.012122
H  2.826259 -5.830891 0.69751
H  -3.347978 -0.798168 1.67388
H  -3.06166 1.628018 -1.920617
H  -5.762864 -0.405633 1.762022
H  -5.486771 2.044727 -1.849792
H  -7.732553 1.478055 -2.033234
H  -7.47473 2.93575 -1.020972
H  -8.953796 1.953092 -0.818559
H  -7.71116 0.828139 2.083434
H  -7.974725 -0.63106 1.073906
H  -9.087529 0.760836 0.946992
