program: Gaussian 09
title: 000044146
version: EM64L-G09RevD.01
frameworkgroup: C1[X(C18H19ClNS)]
method: RPBEPBE
basis: SDD
operation: Freq
keyword: #p
keyword: freq=noraman
keyword: PBEPBE/SDD
title: #p freq=noraman PBEPBE/SDD
converged: NO YES NO NO
title: Mulliken charges:
elementType: Cl S N C C C C C C C C C C C C C C C C C C H H H H H H H H H H H H H H H H H H H
charge: 0.007341 0.244135 -0.105573 -0.204229 -0.302695 -0.359559 -0.506053 0.588108 -0.606961 -0.602017 0.521996 -0.471646 -0.381862 -0.322024 -0.404666 -0.180030 -0.223127 -0.172846 -0.231170 -0.218272 -0.220643 0.291237 0.289910 0.270021 0.278292 0.290814 0.229369 0.265293 0.272149 0.288002 0.263229 0.280122 0.284070 0.273988 0.236655 0.278652 0.270396 0.249958 0.283553 0.256083
chargesum: 1.00000
title: Mulliken charges with hydrogens summed into heavy atoms:
elementType: Cl S N C C C C C C C C C C C C C C C C C C
charge: 0.007341 0.244135 -0.105573 0.087008 -0.012784 0.188753 0.014130 0.588108 0.218483 0.225404 0.521996 -0.471646 -0.381862 -0.048036 -0.168011 0.098622 0.047269 -0.172846 0.018788 0.065281 0.035440
polarizability: 2.67853655e+02 2.95373470e+00 2.18731865e+02 7.57309326e+00 -1.74655709e+01 1.71611687e+02
1716.lowfreq: -13.5476 -0.0029 -0.0028 -0.0027 3.2504 6.1190 37.1527 51.1444 78.8546
frequency: 37.1398 51.1258 78.8371 89.1492 102.6081 124.7652 142.6929 209.6661 231.3166 233.5314 239.7766 257.6650 278.3716 287.4941 311.2593 314.1992 339.3782 350.0787 383.9713 394.1336 402.7894 418.9204 433.3848 467.0823 477.0752 508.4880 531.2076 545.5193 554.5930 568.6708 616.3936 641.2038 669.9382 691.1761 708.0345 741.0068 751.2079 757.0407 774.7541 826.1647 839.2142 845.0237 884.2283 897.2238 910.4620 930.2612 960.8060 962.9690 972.1796 975.5707 1004.8732 1011.5864 1014.3171 1032.8009 1042.8930 1066.8879 1078.0237 1096.0961 1100.9390 1113.0619 1134.3912 1138.1759 1176.7042 1181.8323 1201.9808 1207.0720 1222.2861 1225.6166 1238.2146 1250.8799 1269.3984 1289.8297 1296.6373 1312.5835 1338.4116 1346.6893 1352.5959 1364.8669 1383.7406 1389.2241 1420.7115 1432.9986 1444.2337 1456.3724 1463.2584 1464.3169 1468.4917 1476.5228 1481.5602 1487.5099 1494.9132 1555.7836 1581.7452 1584.2146 1599.2717 2954.2017 3006.0591 3019.9901 3022.2268 3024.9263 3051.6390 3096.0651 3126.5404 3130.0794 3136.9994 3137.4939 3144.9708 3149.4527 3152.0113 3152.8565 3158.3141 3162.9725 3178.7975 3182.3260
redmass: 6.4918 3.4793 3.5654 4.3599 4.4497 4.4088 3.8702 3.9040 4.8446 3.5178 2.5152 1.4538 5.0463 4.0392 4.5701 1.2828 5.5930 3.4989 4.5684 3.0584 4.2998 3.1912 3.2688 3.8664 4.1985 3.9461 4.2897 4.3210 3.5333 3.7404 6.0740 6.3295 6.0997 5.1193 5.8368 4.2391 3.2266 2.5194 1.4956 1.9656 1.3853 2.9220 1.4293 1.7845 2.1982 3.1800 1.5736 2.0517 1.3906 2.0107 1.3482 3.1678 4.9459 5.1660 2.2371 1.8637 2.2423 1.6151 1.6621 1.9787 1.7062 1.6126 1.4587 1.0716 1.6984 1.5121 1.7855 1.8108 1.3611 1.4039 1.3974 1.5877 1.3065 1.3483 1.3666 1.5369 1.9574 5.8632 3.8389 2.3979 1.1492 2.0648 1.1532 2.1725 1.0664 2.4178 1.0858 1.0863 1.0765 1.0611 1.0548 6.9707 6.0679 6.6788 6.6478 1.0808 1.0852 1.0326 1.0632 1.0331 1.0606 1.1020 1.1085 1.1048 1.0882 1.1046 1.1034 1.1029 1.0891 1.0945 1.0901 1.0945 1.1007 1.0972
irintensity: 0.2714 0.2430 0.1110 2.2370 2.5249 0.1610 0.3383 0.4611 1.5697 2.4945 0.9090 0.0725 1.2189 0.2930 1.7019 1.2652 1.7124 1.2700 0.9211 1.7056 1.6427 1.0520 0.7906 17.3686 6.0265 11.6698 3.3612 22.2605 4.2981 3.5387 5.9704 1.3104 10.9833 2.9920 11.6618 3.7769 22.6180 26.6742 51.4736 7.8017 37.9039 20.1649 0.8884 36.3055 4.9965 8.7905 2.6207 14.6447 0.0273 1.2178 0.0931 22.5871 13.9602 10.5220 4.0575 9.6697 7.9731 23.6015 6.9629 11.2348 1.8729 1.9032 5.2116 1.0975 13.7727 8.3740 10.0772 14.5765 2.3464 5.3013 8.9311 2.1893 8.7087 0.5615 1.2066 3.1366 5.7828 15.1039 3.9805 6.1261 24.1317 6.9847 10.7206 74.5885 8.0893 27.5834 4.0413 11.9927 51.3687 21.1017 25.4333 13.2458 1.2244 9.4188 0.6115 8.7214 3.6553 4.9217 11.0628 6.0119 9.5572 4.6289 4.3468 2.3363 4.4499 5.7632 2.9808 3.4773 3.3101 2.4244 0.0462 5.5855 9.7050 0.0988
temp: 298.150 k
press: 1.00000 atm
elementType: 17 16 7 6 6 6 6 6 6 6 6 6 6 6 6 6 6 6 6 6 6 1 1 1 1 1 1 1 1 1 1 1 1 1 1 1 1 1 1 1
symmnumber: 1
zpe: 855343.0 jmol-1
zpe.correction: 0.325783 hartree
zpe.thermalcorrener: 0.344114 hartree
zpe.thermalcorrenthalpy: 0.345058 hartree
zpe.thermalcorrgfe: 0.280020 hartree
zpe.sumelectzpe: -1608.430597 hartree
zpe.sumelectthermal: -1608.412265 hartree
zpe.sumelectthermalent: -1608.411321 hartree
zpe.sumelectthermalfe: -1608.476359 hartree
dipole: -0.5232 8.2052 0.1888
dipole: 8.2241
quadrupole: -113.9866 -87.1216 -126.7057
quadrupole: 5.8834 10.6969 -2.0672
quadrupole: -4.7153 22.1497 -17.4344 5.8834 10.6969 -2.0672
hfenergy: -1608.7563795 hartree
pointgroup: C01 [X(C18H19Cl1N1S1)]
dipole: -0.0954832 -3.2316414 0.1284056 debye
polarizability: 268.0296666|-3.5482771|219.2974623|5.6484246|16.8103039|170.870078 unknown
InChI: InChI=1S/C18H19ClNS/c1-20(2)10-9-14-13-5-3-4-6-16(13)21-17-8-7-12(19)11-15(17)18(14)20/h3-8,11,14,18H,9-10H2,1-2H3
charge 1 multiplicity 1
40 atoms
Cl -4.496264 1.603736 -1.912944
S  0.685976 1.235815 1.941144
N  -0.999241 -2.458003 0.185735
C  -0.271322 -1.105545 -0.336011
C  1.131402 -1.279399 0.296197
C  0.177654 -3.49244 0.294691
C  1.46805 -2.733753 -0.079745
C  -1.09076 0.152156 -0.106119
C  -2.05336 -2.964276 -0.784701
C  -1.645981 -2.238417 1.548046
C  2.100709 -0.17432 -0.07557
C  -0.830818 1.152296 0.879044
C  1.990611 1.054192 0.628548
C  -2.206149 0.342503 -0.972379
C  3.11092 -0.301334 -1.057917
C  -1.741987 2.223669 1.050682
C  2.868972 2.127023 0.38243
C  -3.092843 1.415481 -0.786693
C  3.997551 0.769547 -1.315074
C  -2.89128 2.353227 0.244987
C  3.882328 1.978895 -0.593876
H  -0.186309 -1.288302 -1.425411
H  1.014942 -1.218888 1.398948
H  -0.048587 -4.342122 -0.367189
H  0.198933 -3.846952 1.336916
H  2.334081 -3.123525 0.478673
H  1.686311 -2.832947 -1.158258
H  -1.600833 -3.093879 -1.779997
H  -2.434981 -3.932472 -0.422882
H  -2.882931 -2.245114 -0.83776
H  -2.023569 -3.205131 1.917458
H  -0.902345 -1.833397 2.249925
H  -2.476432 -1.525043 1.444607
H  -2.363597 -0.332292 -1.82012
H  3.226871 -1.23821 -1.613738
H  -1.527836 2.987753 1.80419
H  2.761211 3.064007 0.936831
H  4.780187 0.658294 -2.072348
H  -3.581594 3.189078 0.387764
H  4.57131 2.80619 -0.790687
