program: Gaussian 09
title: 000044139
version: EM64L-G09RevD.01
frameworkgroup: C1[X(C14H15N3O4)]
method: RPBEPBE
basis: SDD
operation: Freq
keyword: #p
keyword: freq=noraman
keyword: PBEPBE/SDD
title: #p freq=noraman PBEPBE/SDD
converged: YES YES NO NO
title: Mulliken charges:
elementType: O O O O N N N C C C C C C C C C C C C C C H H H H H H H H H H H H H H H
charge: -0.268340 -0.225923 -0.213610 -0.239666 -0.125390 -0.255187 -0.382778 0.353696 0.045765 0.065318 0.453213 -0.650759 -0.795216 -0.359439 -0.382559 -0.213203 -0.210267 0.086791 -0.248636 0.130008 -0.498824 0.271719 0.254931 0.243199 0.233678 0.334390 0.235467 0.385419 0.283121 0.262979 0.231340 0.229930 0.232393 0.246944 0.245996 0.243500
chargesum: 0.00000
title: Mulliken charges with hydrogens summed into heavy atoms:
elementType: O O O O N N N C C C C C C C C C C C C C C
charge: -0.268340 -0.225923 -0.213610 -0.239666 -0.125390 -0.255187 0.002641 0.353696 0.045765 0.065318 0.453213 0.119090 0.008319 -0.076318 -0.119580 0.018137 0.019662 0.086791 -0.016243 0.130008 0.237616
polarizability: 3.24158038e+02 -6.07946078e+00 1.94114422e+02 5.50331471e+00 1.47324856e+01 1.07331505e+02
1716.lowfreq: -4.7652 -1.6017 -0.0009 -0.0008 -0.0007 5.2923 21.8027 35.0765 50.9143
frequency: 21.7384 35.0582 50.8900 55.0019 65.8339 81.5193 93.3516 107.1250 139.1917 149.2468 170.0708 177.7800 199.9903 204.6253 227.9387 246.7100 250.7160 279.1154 295.4466 317.1755 353.5178 374.2640 404.5613 409.0766 433.1477 495.0791 501.7779 515.8933 570.6622 576.5906 613.5438 615.1757 648.2667 662.0878 697.8138 722.2319 753.5868 760.6099 767.0849 800.5598 844.2931 852.3875 862.1282 914.0372 921.1650 948.2757 973.2126 986.5043 993.0981 1013.3371 1037.1036 1053.1273 1067.3852 1081.2202 1099.7009 1112.9914 1121.2534 1130.1776 1151.8211 1173.8066 1187.3325 1199.1142 1201.0398 1238.0246 1289.1297 1321.0398 1342.9823 1366.4486 1385.7994 1409.6647 1420.3316 1434.0876 1445.8456 1453.5862 1458.8355 1460.2234 1476.2595 1484.9587 1486.9336 1497.0806 1520.4708 1590.7047 1604.3342 1606.9585 1609.6198 1629.6577 1650.3509 2970.9316 2975.3835 3008.3716 3051.2652 3090.5540 3104.0042 3111.6372 3130.7897 3132.6209 3141.3414 3153.9711 3160.1875 3167.1397 3187.7961 3355.8906
redmass: 6.2779 5.4399 5.2964 4.0031 4.7821 1.3986 2.6642 4.9208 2.7594 3.6542 3.6769 1.2643 5.1248 5.8086 1.2843 4.6607 4.3912 4.5759 4.2469 4.0571 3.8138 6.0022 7.0270 2.9707 4.8125 7.4571 4.0526 9.2475 5.4439 5.6241 6.2729 6.2533 5.5756 6.1260 2.1786 9.2397 2.8880 10.2187 2.2787 5.6927 1.2746 1.1798 5.8937 1.6711 2.3364 7.3860 1.3664 4.9397 1.3806 3.3584 1.9440 1.4643 2.5367 1.9259 1.8683 1.2649 2.7087 1.8639 1.5234 1.0513 1.1630 3.1504 5.5045 4.0463 3.5807 1.5283 3.3737 4.0924 8.4639 1.2619 1.2064 1.1941 2.1419 1.0493 1.0510 1.0727 1.1082 1.7736 1.2477 1.0724 2.2103 6.5214 7.3468 7.6624 7.2722 9.7427 8.1195 1.0391 1.0437 1.0297 1.0962 1.0900 1.0987 1.1047 1.0857 1.1010 1.0891 1.0943 1.1049 1.0993 1.0966 1.0758
irintensity: 0.0935 6.1546 1.5937 1.7898 4.8320 0.0504 0.6521 2.2479 4.3692 1.0643 3.8057 1.1018 9.8342 3.8093 1.9696 2.3763 4.0257 3.4476 24.8914 21.1552 25.3741 2.9212 13.5571 1.7440 6.0905 5.9413 8.8863 13.2907 30.8297 2.3206 0.5479 37.9354 12.5375 39.7003 41.1834 6.9173 29.1656 2.1255 50.4043 7.7842 0.7951 80.5388 10.2709 4.5337 4.6068 39.2385 0.6674 0.2818 0.4139 46.1349 4.8729 5.3741 3.5599 20.6961 7.0221 0.0206 10.0333 77.3642 4.9715 0.1806 28.6810 17.3136 462.9575 130.9431 118.0850 44.9181 87.9934 138.9077 3.6195 50.2082 16.7650 11.3868 21.0100 16.1386 16.6889 27.8894 50.3779 109.0826 33.9003 20.0700 160.9909 13.1771 3.8023 217.4602 274.7076 173.4210 44.9473 28.6817 80.8161 32.3383 18.2018 13.1217 8.2068 22.7178 3.7745 6.6723 9.8354 24.8848 14.2317 21.7879 1.6466 78.3576
temp: 298.150 k
press: 1.00000 atm
elementType: 8 8 8 8 7 7 7 6 6 6 6 6 6 6 6 6 6 6 6 6 6 1 1 1 1 1 1 1 1 1 1 1 1 1 1 1
symmnumber: 1
zpe: 721909.1 jmol-1
zpe.correction: 0.274961 hartree
zpe.thermalcorrener: 0.295316 hartree
zpe.thermalcorrenthalpy: 0.296261 hartree
zpe.thermalcorrgfe: 0.224313 hartree
zpe.sumelectzpe: -1006.099874 hartree
zpe.sumelectthermal: -1006.079519 hartree
zpe.sumelectthermalent: -1006.078574 hartree
zpe.sumelectthermalfe: -1006.150522 hartree
dipole: 2.4303 3.0609 -0.7169
dipole: 3.9736
quadrupole: -91.9848 -122.0911 -120.3620
quadrupole: 13.3806 1.1031 -1.9722
quadrupole: 19.4945 -10.6118 -8.8827 13.3806 1.1031 -1.9722
hfenergy: -1006.3748351 hartree
pointgroup: C01 [X(C14H15N3O4)]
dipole: 0.9979024 -1.0491482 0.5894695 debye
polarizability: 323.5892937|8.8440497|195.9289471|-8.0446586|-10.228573|106.085724 unknown
InChI: InChI=1S/C14H15N3O4/c1-9-11(15-12(18)14(20)21-3)13(19)17(16(9)2)10-7-5-4-6-8-10/h4-8,15H,1-3H3
charge 0 multiplicity 1
36 atoms
O  0.247456 1.822276 -0.159958
O  -3.396037 -1.835968 0.089567
O  -5.558586 -0.184274 -0.333982
O  -4.142178 1.665575 -0.386581
N  1.294985 -1.518316 0.474326
N  1.586619 -0.129344 0.285559
N  -1.990555 0.066572 0.038431
C  -0.115976 -1.66595 0.49649
C  -0.69003 -0.423059 0.234626
C  0.371612 0.586538 0.10465
C  2.888297 0.305399 -0.114354
C  2.136802 -2.226736 1.469321
C  -0.692127 -3.015082 0.816559
C  3.28499 1.633862 0.181535
C  3.759875 -0.565248 -0.818063
C  4.56059 2.07915 -0.223722
C  5.04001 -0.109962 -1.198924
C  -3.200613 -0.591011 -0.02378
C  5.447445 1.211553 -0.903452
C  -4.331197 0.42747 -0.265678
C  -6.711675 0.722453 -0.570902
H  3.199303 -2.068665 1.232282
H  1.919162 -3.303117 1.403974
H  1.938821 -1.871043 2.499678
H  -0.203554 -3.804937 0.216912
H  -1.770302 -3.010247 0.598155
H  -0.558296 -3.269266 1.886256
H  -2.022593 1.090702 -0.114223
H  2.591813 2.301845 0.698035
H  3.420383 -1.569825 -1.091626
H  4.863305 3.10811 -0.001548
H  5.711178 -0.783844 -1.742662
H  6.43915 1.563502 -1.206749
H  -6.582766 1.255419 -1.527708
H  -6.789796 1.456597 0.248335
H  -7.584216 0.05657 -0.597177
