program: Gaussian 09
title: 000044135
version: EM64L-G09RevD.01
frameworkgroup: C1[X(C19H20ClNS)]
method: RPBEPBE
basis: SDD
operation: Freq
keyword: #p
keyword: freq=noraman
keyword: PBEPBE/SDD
title: #p freq=noraman PBEPBE/SDD
converged: YES YES NO NO
title: Mulliken charges:
elementType: Cl S N C C C C C C C C C C C C C C C C C C C H H H H H H H H H H H H H H H H H H H H
charge: -0.062276 0.246608 -0.078198 -0.580238 -0.391351 0.397803 -0.334887 0.374434 -0.503065 -0.402365 0.520933 -0.401081 -0.389962 -0.230368 -0.626327 -0.616155 -0.358269 -0.249507 -0.222088 -0.239313 -0.118240 -0.234139 0.215741 0.199636 0.225690 0.237516 0.208443 0.166860 0.224984 0.236930 0.236601 0.219731 0.182940 0.184865 0.222343 0.225031 0.257440 0.267448 0.231590 0.259109 0.235038 0.260117
chargesum: 0.00000
title: Mulliken charges with hydrogens summed into heavy atoms:
elementType: Cl S N C C C C C C C C C C C C C C C C C C C
charge: -0.062276 0.246608 -0.078198 -0.164861 0.071855 0.397803 0.040415 0.374434 -0.278081 -0.402365 0.520933 -0.401081 -0.153032 0.027072 0.012944 0.016084 -0.090821 -0.017918 0.037021 -0.004275 -0.118240 0.025978
polarizability: 3.28244948e+02 3.90217895e+01 2.46993620e+02 -2.59982008e+01 1.31864305e+01 1.75300315e+02
1716.lowfreq: -4.4566 -2.6250 -0.0018 -0.0013 0.0011 4.7472 20.7182 26.7245 31.1677
frequency: 20.6424 26.6723 31.0273 41.3909 80.5596 89.5627 97.3607 111.5904 115.8986 148.8473 164.6452 217.4779 227.8013 237.0416 243.1357 257.5191 276.0124 291.5319 316.0503 333.1861 344.1708 353.5010 360.8886 402.3980 419.1462 444.8435 460.3162 466.3821 488.2526 511.6567 542.5258 563.6867 571.4069 624.5163 659.3630 662.1808 700.4402 724.3139 741.9554 752.1278 760.3816 775.5772 816.1307 818.6932 843.2646 855.5323 876.2971 885.0115 908.6843 948.9329 953.8750 989.4339 1006.9298 1021.4036 1031.1981 1032.2951 1035.6207 1038.4040 1060.1114 1075.0634 1083.3542 1091.3845 1095.0774 1127.0668 1130.2103 1132.5659 1158.2430 1176.0202 1205.9543 1213.5594 1229.8787 1251.7492 1257.3123 1258.8620 1272.4473 1276.9029 1299.7010 1331.4147 1343.7093 1361.9237 1374.3000 1378.5325 1393.3630 1419.2724 1419.6826 1442.5303 1453.1586 1459.6938 1463.2291 1464.4397 1472.4896 1474.2495 1479.5563 1483.3622 1488.7265 1550.2607 1563.2766 1586.2534 1594.8316 1630.1863 2804.4388 2838.6749 2855.6346 2964.9086 2996.1387 3003.9017 3017.3541 3024.8799 3030.6540 3067.7450 3076.5577 3086.5679 3088.2793 3130.8403 3143.0866 3152.5198 3154.7234 3155.0913 3169.0527 3177.7103
redmass: 4.6989 4.1841 3.3002 5.9463 4.1206 3.1028 6.3289 3.1745 2.0130 4.9373 5.1646 3.4990 1.3600 1.8374 2.4213 2.9619 5.3226 3.8863 4.2337 2.5340 3.9274 5.3123 5.0748 3.0239 4.9833 2.8319 3.2663 3.5180 4.3276 4.8228 4.8507 4.2652 4.7723 3.9279 6.0270 5.4448 5.1289 4.5920 2.0142 2.1957 1.7944 1.6944 1.3716 4.3943 1.4021 1.7751 1.4170 1.7572 2.2557 1.3561 1.3874 1.3357 4.1336 3.9720 2.7147 3.7880 2.0952 2.7877 2.5391 2.1295 1.9326 1.6010 1.6581 1.4244 1.5726 1.4663 1.5788 1.0799 2.4359 1.7121 1.8051 1.5491 1.4491 1.8682 1.6031 1.3347 1.2103 1.4879 2.6717 7.9124 1.4025 5.4795 1.7822 2.1223 1.1563 1.1597 2.6081 1.0665 1.0692 2.3384 1.0959 1.0862 1.0557 1.0765 1.0835 6.6948 5.9117 7.8370 6.4378 7.9913 1.0702 1.0578 1.0577 1.0622 1.0740 1.0712 1.0716 1.0961 1.0716 1.1041 1.1010 1.0877 1.1001 1.0850 1.0891 1.0893 1.0944 1.0922 1.1008 1.0970
irintensity: 0.0786 0.1501 0.3333 0.2680 0.1834 0.8052 0.1117 0.3994 0.6815 0.1289 0.1158 0.6490 1.9634 1.0322 0.2261 0.7849 2.1245 1.1125 0.3584 7.0669 1.1160 5.8532 0.3196 0.6886 1.3427 0.7654 11.3358 24.5154 3.8226 8.5471 4.9330 2.4437 3.0355 2.7581 4.4143 2.6912 6.6901 6.6327 12.0887 3.2388 6.6093 77.2176 41.7168 10.8506 4.3250 15.8961 0.6832 20.7580 36.3877 0.2704 1.9946 0.2454 5.6928 50.7425 8.9455 16.3987 10.4212 6.8647 1.2186 29.3548 28.1951 9.3359 6.2748 11.8251 0.0756 2.5876 10.0976 0.5944 14.1745 9.2922 20.4715 1.5570 3.0868 1.7982 5.9364 9.7712 6.7328 1.8927 1.9021 1.0984 17.2058 8.0785 15.2549 11.5076 3.4831 2.5971 74.2919 5.2044 15.2255 19.0831 7.1539 4.1810 9.7133 13.1661 23.2707 22.6610 0.9822 32.6858 1.0841 21.9493 80.5426 70.3339 237.8475 26.2020 4.5529 37.5736 47.2992 11.7426 41.5407 34.9549 38.7898 17.1937 52.3482 0.5687 7.2766 1.4747 20.7701 0.8331 27.0796 2.8031
temp: 298.150 k
press: 1.00000 atm
elementType: 17 16 7 6 6 6 6 6 6 6 6 6 6 6 6 6 6 6 6 6 6 6 1 1 1 1 1 1 1 1 1 1 1 1 1 1 1 1 1 1 1 1
symmnumber: 1
zpe: 883336.7 jmol-1
zpe.correction: 0.336445 hartree
zpe.thermalcorrener: 0.357638 hartree
zpe.thermalcorrenthalpy: 0.358582 hartree
zpe.thermalcorrgfe: 0.284287 hartree
zpe.sumelectzpe: -1647.274035 hartree
zpe.sumelectthermal: -1647.252843 hartree
zpe.sumelectthermalent: -1647.251899 hartree
zpe.sumelectthermalfe: -1647.326194 hartree
dipole: 2.7287 1.2944 -1.7501
dipole: 3.4906
quadrupole: -143.1489 -134.6624 -146.7959
quadrupole: -5.8673 -11.1899 2.4336
quadrupole: -1.6132 6.8733 -5.2602 -5.8673 -11.1899 2.4336
hfenergy: -1647.6104806 hartree
pointgroup: C01 [X(C19H20Cl1N1S1)]
dipole: 1.0477814 0.6149243 -0.6402784 debye
polarizability: 324.1111575|44.8736447|249.1007037|-22.7985456|17.5336904|177.3270213 unknown
InChI: InChI=1S/C19H20ClNS/c1-21(2)11-5-6-14-12-15-13-16(20)9-10-18(15)22-19-8-4-3-7-17(14)19/h3-4,7-10,12-13H,5-6,11H2,1-2H3
charge 0 multiplicity 1
42 atoms
Cl -5.838106 -2.46433 -0.896552
S  -1.170801 0.995717 1.923202
N  5.194396 -1.439641 0.624498
C  1.658243 -1.106735 -0.955115
C  2.791491 -0.869945 0.079967
C  0.33975 -0.44744 -0.552977
C  4.119312 -1.497089 -0.392845
C  0.319898 1.045816 -0.515679
C  -0.745162 -1.260575 -0.31926
C  -0.340106 1.812287 0.488886
C  -2.129897 -0.927745 0.064078
C  -2.481292 0.077753 1.011355
C  0.99847 1.775137 -1.537756
C  -0.325225 3.224931 0.46976
C  5.64008 -0.065072 0.928952
C  6.331249 -2.314992 0.27314
C  -3.184683 -1.702681 -0.503088
C  1.021676 3.183626 -1.56053
C  -3.83082 0.320594 1.350164
C  0.362181 3.918652 -0.549373
C  -4.51724 -1.451358 -0.145095
C  -4.869231 -0.446621 0.777169
H  1.498898 -2.194948 -1.077005
H  2.001939 -0.732574 -1.941713
H  2.910067 0.217789 0.240171
H  2.511297 -1.314476 1.052683
H  3.941754 -2.56618 -0.624886
H  4.433733 -1.006811 -1.355437
H  -0.587099 -2.333069 -0.505248
H  1.502086 1.224758 -2.338736
H  4.803786 0.533304 1.326967
H  6.425913 -0.098088 1.704561
H  6.057106 0.46929 0.035776
H  6.860976 -2.005041 -0.664726
H  7.069421 -2.313424 1.095197
H  5.975196 -3.351937 0.136883
H  -0.851565 3.771753 1.258429
H  -2.947637 -2.48878 -1.2268
H  1.549022 3.705392 -2.366488
H  -4.070166 1.10481 2.074797
H  0.377913 5.013683 -0.554316
H  -5.914324 -0.270341 1.045591
