program: Gaussian 09
title: 000044182
version: EM64L-G09RevD.01
frameworkgroup: C1[X(C20H25NO3)]
method: RPBEPBE
basis: SDD
operation: Freq
keyword: #p
keyword: freq=noraman
keyword: PBEPBE/SDD
title: #p freq=noraman PBEPBE/SDD
converged: NO YES NO NO
title: Mulliken charges:
elementType: O O O N C C C C C C C C C C C C C C C C C C C C H H H H H H H H H H H H H H H H H H H H H H H H H
charge: -0.252486 -0.250618 -0.446595 0.002122 -0.178840 -0.017066 -0.462457 -0.453642 -0.490869 -0.444488 -0.453104 0.174890 -0.047930 0.421958 0.020037 -0.382651 -0.386707 -0.034101 -0.163439 -0.232328 -0.227527 -0.242087 -0.679951 -0.678985 0.241707 0.255539 0.217107 0.215850 0.241566 0.209977 0.244938 0.252096 0.227788 0.231821 0.226249 0.234833 0.366808 0.238495 0.267574 0.237384 0.223514 0.225196 0.226681 0.217907 0.211690 0.228989 0.213036 0.215596 0.234526
chargesum: 0.00000
title: Mulliken charges with hydrogens summed into heavy atoms:
elementType: O O O N C C C C C C C C C C C C C C C C C C C C
charge: -0.252486 -0.250618 -0.079787 0.002122 0.062867 0.238473 -0.029501 -0.002100 0.006164 0.015121 0.007978 0.174890 -0.047930 0.421958 0.020037 -0.144156 -0.119133 -0.034101 0.073946 -0.008813 -0.002331 -0.015407 -0.021365 -0.015827
polarizability: 2.20480236e+02 2.25183430e+01 2.37881836e+02 5.26120606e+00 -6.24030000e+00 2.10046525e+02
1716.lowfreq: -23.2405 -14.3957 -5.1917 -4.6247 -0.0005 0.0004 0.0006 14.8739 21.3463
frequency: -22.8637 11.0562 21.2090 26.8316 38.0642 39.0028 48.0236 69.4283 86.2322 100.5823 129.2361 170.7301 190.6370 201.9549 204.9484 227.7405 246.0647 251.5207 275.0444 284.3444 303.6826 327.8343 365.1819 377.6531 398.1813 400.3557 403.6602 410.5975 425.8795 473.4434 499.1965 517.1730 524.0030 535.8889 571.4025 593.4411 601.7365 615.6262 628.9161 690.4198 701.4414 726.8789 745.3736 769.9189 786.1450 798.8317 806.6962 813.4376 833.0369 855.3513 872.0826 886.1199 904.9203 911.8724 917.7022 934.8925 935.2068 954.8014 956.4349 979.3404 983.0157 989.1146 990.8020 997.0151 999.2676 1018.4292 1026.4949 1053.3798 1056.9071 1075.1747 1089.4652 1098.3542 1110.3720 1128.6975 1129.0636 1158.5175 1169.1826 1171.1112 1180.4217 1187.0626 1200.3606 1215.7098 1222.4126 1230.1326 1271.7251 1281.9514 1295.2004 1299.9883 1304.9029 1308.6837 1310.6333 1312.4985 1312.9010 1315.9440 1328.1209 1339.5572 1348.1849 1362.6226 1375.3773 1383.7240 1393.4437 1435.2083 1435.2968 1457.9343 1463.6495 1465.9430 1467.3998 1469.0153 1475.9641 1478.0888 1479.6278 1486.1041 1595.4772 1597.2084 1611.7030 2264.1548 2969.7187 2981.4925 2984.1136 2984.6139 2992.9844 3002.5206 3003.8725 3006.5221 3030.1308 3041.8023 3051.1820 3054.0325 3068.7090 3075.8300 3077.9668 3078.6684 3084.3474 3088.7821 3094.1687 3122.9031 3134.1563 3147.5487 3158.9847 3170.5624 3446.8535
redmass: 2.5988 4.0821 3.6829 4.2500 3.4108 4.2741 3.6856 7.5661 4.0807 3.9128 3.7027 2.6161 4.4120 3.1986 1.0598 5.1660 1.3039 3.1861 2.8414 2.3114 3.0786 3.2995 4.8180 2.8384 2.4859 4.8816 2.8323 2.2957 1.6623 5.5295 3.7150 5.0091 4.0323 4.1952 4.4480 8.1922 4.4870 6.3536 5.5730 7.6990 1.9329 3.6819 3.4323 2.3574 1.5690 3.3066 1.7844 2.7320 2.1610 1.2478 3.0004 3.5351 3.3902 2.5333 1.1816 1.7803 2.0237 1.4551 3.5741 1.5690 2.8999 2.9412 4.9404 1.4826 2.7148 2.7338 2.2239 2.7810 1.9406 2.3669 1.5963 1.6875 2.5267 2.0877 1.3736 2.7104 1.2981 1.0758 1.7995 1.4335 1.3789 1.3958 3.0611 1.2761 1.4427 1.3202 1.2703 1.3264 1.3093 1.3730 1.3345 1.3978 1.4042 1.5126 1.3212 1.3924 1.3938 1.5165 1.1910 9.7753 1.2000 1.2832 1.6803 1.0782 1.0455 1.0800 1.0686 1.0657 1.0455 2.2359 1.0917 1.0563 6.4752 10.2019 6.3777 11.9214 1.0824 1.0347 1.0351 1.0603 1.0592 1.0601 1.0627 1.0639 1.0870 1.1023 1.0978 1.0936 1.1049 1.1043 1.1011 1.1039 1.1000 1.1008 1.1004 1.0847 1.0887 1.0933 1.0971 1.0981 1.0647
irintensity: 0.0088 0.2261 0.0170 0.3601 0.1788 0.2277 0.6948 1.0947 0.1078 1.1532 0.7015 0.6617 4.6915 0.6169 0.0485 6.3785 0.3757 1.9089 18.2568 31.7159 36.4489 14.3759 3.2804 16.3743 5.2810 0.6155 0.7008 5.5472 41.1211 1.1289 8.6949 2.1570 2.9412 0.9353 11.8479 3.4826 12.6303 0.0862 18.0179 14.5529 41.1708 34.2388 32.4209 33.8144 5.8435 1.7984 7.7691 13.0448 19.7323 0.1533 1.5057 9.0474 14.7614 13.4147 3.6307 15.8602 11.0339 0.0718 20.8461 9.9729 41.0237 69.8923 1.6404 4.4871 29.7429 4.7214 15.7984 44.5581 7.3903 11.3957 5.5745 0.0760 5.6617 16.4489 6.9544 237.4548 6.0454 3.9253 92.0039 22.1737 17.1089 5.4103 45.8718 0.8128 3.9787 0.4062 5.1588 3.2332 3.1243 8.1073 1.8072 9.1866 4.3096 27.5387 1.4474 70.9576 3.3393 5.3556 13.3602 0.2856 8.4917 8.6403 18.9847 0.9352 5.4485 8.4750 4.9658 15.7390 11.0712 17.3918 15.9689 21.2834 0.1985 169.3547 17.4172 29.6966 13.1801 26.3941 30.3017 33.5851 30.9026 71.8387 62.9968 27.4677 6.2337 9.2461 15.0901 20.9041 17.2143 42.3111 14.1799 66.2649 89.0426 25.7725 33.3318 0.0880 10.0361 29.3724 21.1627 12.7684 40.7828
temp: 298.150 k
press: 1.00000 atm
elementType: 8 8 8 7 6 6 6 6 6 6 6 6 6 6 6 6 6 6 6 6 6 6 6 6 1 1 1 1 1 1 1 1 1 1 1 1 1 1 1 1 1 1 1 1 1 1 1 1 1
symmnumber: 1
zpe: 1067299.7 jmol-1
zpe.correction: 0.406513 hartree
zpe.thermalcorrener: 0.429444 hartree
zpe.thermalcorrenthalpy: 0.430388 hartree
zpe.thermalcorrgfe: 0.351130 hartree
zpe.sumelectzpe: -1055.675175 hartree
zpe.sumelectthermal: -1055.652243 hartree
zpe.sumelectthermalent: -1055.651299 hartree
zpe.sumelectthermalfe: -1055.730558 hartree
dipole: 2.7633 -0.1429 -3.0367
dipole: 4.1082
quadrupole: -147.3272 -127.3433 -141.6691
quadrupole: -4.0138 2.5419 -0.7246
quadrupole: -8.5473 11.4366 -2.8892 -4.0138 2.5419 -0.7246
hfenergy: -1056.0816875 hartree
pointgroup: C01 [X(C20H25N1O3)]
dipole: -1.0462609 0.0861111 1.2289716 debye
polarizability: 220.6802105|-21.5431189|239.2295641|7.3917494|3.6368513|208.4988221 unknown
InChI: InChI=1S/C20H25NO3/c1-15(2)8-11-20(23,17-6-4-3-5-7-17)19(22)24-18-14-21-12-9-16(18)10-13-21/h3-7,15-16,18,23H,9-10,12-14H2,1-2H3
charge 0 multiplicity 1
49 atoms
O  -0.551041 -0.781895 -0.230781
O  -0.229112 -1.052058 -2.523274
O  2.340093 -0.272337 -2.423508
N  -3.896732 0.36638 0.005834
C  -2.482429 -1.550996 1.059005
C  -1.984053 -1.2361 -0.364346
C  -3.969692 -1.991472 0.932586
C  -2.397237 -0.278307 1.945971
C  -2.873233 -0.095246 -0.97061
C  -4.793498 -0.777457 0.358921
C  -3.215426 0.865391 1.242737
C  0.178532 -0.709001 -1.384425
C  1.606836 -0.088265 -1.165371
C  2.365741 -0.843719 -0.057658
C  1.396395 1.346895 -0.87173
C  2.391127 -0.371065 1.274343
C  3.016567 -2.05763 -0.382989
C  1.198136 2.549421 -0.676369
C  0.962013 3.988832 -0.434802
C  3.060065 -1.108717 2.276384
C  3.684859 -2.793804 0.619619
C  3.706982 -2.323812 1.953536
C  -0.558768 4.297771 -0.340861
C  1.716361 4.474577 0.834293
H  -1.872843 -2.3622 1.493072
H  -1.976975 -2.135022 -1.007159
H  -4.342613 -2.292776 1.928782
H  -4.053315 -2.876989 0.273106
H  -1.341485 0.011026 2.083074
H  -2.812958 -0.510278 2.944444
H  -2.236967 0.764444 -1.249764
H  -3.38288 -0.447461 -1.883866
H  -5.351526 -1.068094 -0.549419
H  -5.528652 -0.411167 1.097394
H  -3.990744 1.277125 1.913405
H  -2.554009 1.699196 0.944075
H  1.657066 -0.352418 -3.147616
H  1.896989 0.574668 1.52087
H  3.021868 -2.395656 -1.423408
H  1.3697 4.542562 -1.306114
H  3.080985 -0.73351 3.305894
H  4.19435 -3.728373 0.359035
H  4.228919 -2.893855 2.730568
H  -0.717083 5.383104 -0.205515
H  -1.008621 3.772694 0.521645
H  -1.089826 3.978547 -1.254532
H  1.33192 3.96123 1.734143
H  1.571853 5.56223 0.96745
H  2.798263 4.271083 0.756833
