program: Gaussian 09
title: 000044108
version: EM64L-G09RevD.01
frameworkgroup: C1[X(C13H12N2O6S2)]
method: RPBEPBE
basis: SDD
operation: Freq
keyword: #p
keyword: freq=noraman
keyword: PBEPBE/SDD
title: #p freq=noraman PBEPBE/SDD
converged: NO YES NO NO
title: Mulliken charges:
elementType: S S O O O O O O N N C C C C C C C C C C C C C H H H H H H H H H H H H
charge: 0.977577 0.958293 -0.516431 -0.499454 -0.528260 -0.525874 -0.440629 -0.250986 -0.595074 -0.719208 -0.069458 -0.031310 -0.185413 -0.244813 0.442952 -0.219890 -0.209579 -0.389372 -0.348230 0.262627 -0.329099 -0.322293 0.114350 0.311990 0.294910 0.300068 0.298707 0.297100 0.234064 0.303637 0.275579 0.280951 0.345498 0.339864 0.387204
chargesum: 0.00000
title: Mulliken charges with hydrogens summed into heavy atoms:
elementType: S S O O O O O O N N C C C C C C C C C C C C C
charge: 0.977577 0.958293 -0.516431 -0.499454 -0.528260 -0.525874 -0.053425 -0.250986 -0.283084 -0.033846 -0.069458 -0.031310 0.109498 0.055255 0.442952 0.078817 0.087521 -0.155308 -0.044592 0.262627 -0.053520 -0.041342 0.114350
polarizability: 2.66117812e+02 3.51220240e+01 2.69473563e+02 -2.14469797e+01 -6.75591078e+00 1.91013437e+02
1716.lowfreq: -13.6272 -8.2830 -6.3862 -0.0019 -0.0015 -0.0013 7.9424 9.6527 21.0354
frequency: -2.0646 8.9968 20.8778 45.4305 48.3936 71.1585 79.4196 92.9651 95.1394 129.0782 138.7552 161.6259 163.2823 169.9317 188.5627 194.9868 243.0845 262.9598 273.4135 295.3821 299.1884 316.4410 334.9400 355.3582 377.9859 401.9361 410.4542 413.8654 429.3923 433.2795 457.5905 474.3010 487.6299 497.4127 529.6265 574.9835 591.6792 604.7624 626.5529 679.5103 683.4101 710.7507 718.8716 722.5318 763.7490 795.2394 805.0718 816.5152 828.3857 844.3926 850.9420 858.9172 872.2832 912.7222 964.7091 971.2801 977.0211 983.9861 991.3859 997.7980 1001.0066 1021.8967 1037.0550 1045.1329 1071.4765 1109.2963 1117.0420 1148.3289 1171.9340 1192.8416 1233.7128 1270.8423 1279.1994 1315.6837 1324.2070 1372.9219 1393.3307 1399.5539 1429.2246 1443.1192 1493.3890 1535.1979 1559.2347 1566.1994 1602.9699 1612.3006 1639.2064 3130.4105 3154.2431 3158.5997 3162.8087 3164.1444 3170.3056 3175.9837 3182.0667 3370.4629 3444.7559 3534.1767 3537.4302
redmass: 5.4064 8.7822 7.0670 4.5351 6.1420 7.2077 7.3947 7.5020 9.4288 2.1699 3.2607 8.9240 7.9053 8.6285 10.1948 10.1024 6.7080 4.2007 3.0474 9.3615 6.8789 8.0458 8.6902 6.2817 5.4995 3.9588 2.8785 3.9025 10.2991 2.5821 7.1158 4.3936 4.4709 3.1365 3.4059 4.5118 1.2780 7.0567 5.5600 5.3319 3.8660 4.8695 3.0791 2.7226 3.9712 1.6978 10.5751 11.3461 4.3819 1.4178 1.3205 1.3879 1.5476 3.9096 11.1276 2.8808 1.9519 1.3708 1.3822 4.0168 1.3924 2.8698 2.7867 2.9907 1.4908 1.3517 1.3588 1.6607 1.1385 1.2131 1.5748 2.2917 1.2394 1.4192 2.6709 3.3971 4.1260 7.3531 3.3228 2.0283 2.6296 1.0869 5.8039 7.0509 8.1388 6.1322 8.6547 1.0895 1.0889 1.0894 1.0896 1.0955 1.0972 1.0975 1.0970 1.0415 1.0767 1.0642 1.1006
irintensity: 0.3163 0.3812 1.2873 0.8263 3.2392 0.9527 2.2254 1.1470 9.7510 26.5146 8.9938 2.1627 0.5259 1.5578 5.0656 2.0970 1.4646 6.1281 11.4896 23.6684 28.8060 4.5576 6.2879 10.2053 5.2783 38.0302 0.5042 7.6101 17.6845 27.3832 137.7818 160.5035 5.4222 26.0803 158.3619 82.2743 80.2112 0.1166 3.6486 3.5445 77.7327 1.3985 27.6190 54.8002 13.2994 105.8429 152.4180 168.4438 25.6954 18.0492 4.0726 22.4306 42.9648 54.5204 42.7894 0.9853 8.7420 0.8993 0.0234 129.6816 2.4208 207.3762 17.8191 17.5528 26.7561 0.5200 8.2789 165.6938 3.1117 6.6556 7.4535 48.3390 0.6607 9.7141 145.6591 37.0084 10.3725 2.6476 19.2659 13.4543 31.9368 26.5477 7.5137 16.2033 0.0576 139.2448 327.0637 6.3675 7.5099 4.6897 0.3051 2.5216 3.2259 0.9124 0.1154 33.3175 28.6302 59.8063 29.2257
temp: 298.150 k
press: 1.00000 atm
elementType: 16 16 8 8 8 8 8 8 7 7 6 6 6 6 6 6 6 6 6 6 6 6 6 1 1 1 1 1 1 1 1 1 1 1 1
symmnumber: 1
zpe: 619797.1 jmol-1
zpe.correction: 0.236068 hartree
zpe.thermalcorrener: 0.258688 hartree
zpe.thermalcorrenthalpy: 0.259632 hartree
zpe.thermalcorrgfe: 0.181595 hartree
zpe.sumelectzpe: -1857.534608 hartree
zpe.sumelectthermal: -1857.511988 hartree
zpe.sumelectthermalent: -1857.511044 hartree
zpe.sumelectthermalfe: -1857.589080 hartree
dipole: -0.9926 -3.4721 -2.9049
dipole: 4.6346
quadrupole: -172.6128 -165.0190 -143.7415
quadrupole: 0.7100 -17.2024 -7.9691
quadrupole: -12.1550 -4.5612 16.7162 0.7100 -17.2024 -7.9691
hfenergy: -1857.7706758 hartree
pointgroup: C01 [X(C13H12N2O6S2)]
dipole: -0.5237321 1.3380755 1.1225005 debye
polarizability: 273.1537047|-34.4128072|262.3146404|22.485907|-5.6739431|191.1364667 unknown
InChI: InChI=1S/C13H12N2O6S2/c14-22(18,19)11-5-7-12(8-6-11)23(20,21)15-10-3-1-9(2-4-10)13(16)17/h1-8,15-16H,14H2
charge 0 multiplicity 1
35 atoms
S  0.176287 -3.038753 -0.18394
S  4.247858 2.046385 -0.154669
O  0.871977 -4.231181 0.666733
O  -0.386284 -3.208303 -1.691618
O  5.630995 1.550437 0.543273
O  4.16218 2.7383 -1.624737
O  -4.88709 2.276322 -1.366654
O  -4.668468 3.028201 0.821274
N  -1.296707 -2.553897 0.899157
N  3.456018 3.179326 1.052094
C  1.363945 -1.553748 -0.18928
C  3.058703 0.575316 -0.163877
C  1.175336 -0.556842 -1.161176
C  2.385605 -1.541404 0.776287
C  -2.0263 -1.371599 0.639744
C  2.05511 0.550001 -1.145136
C  3.267327 -0.437561 0.786456
C  -2.258912 -0.42954 1.685043
C  -2.58346 -1.145869 -0.653057
C  -3.595458 0.938516 0.155118
C  -3.053663 0.702964 1.445894
C  -3.34879 0.007583 -0.890075
C  -4.40951 2.161629 -0.050264
H  -1.011172 -2.737253 1.873414
H  0.390342 -0.650674 -1.917205
H  2.50452 -2.37804 1.472366
H  1.981052 1.351398 -1.886918
H  4.103607 -0.377719 1.489927
H  -1.823947 -0.596586 2.677831
H  -2.424086 -1.888409 -1.440412
H  -3.252907 1.429303 2.240495
H  -3.783154 0.188882 -1.876966
H  4.151954 3.409457 1.780804
H  3.096262 4.007637 0.549871
H  -5.426972 3.108322 -1.439099
