program: Gaussian 09
title: 000044096
version: EM64L-G09RevD.01
frameworkgroup: C1[X(C13H15ClO)]
method: RPBEPBE
basis: SDD
operation: Freq
keyword: #p
keyword: freq=noraman
keyword: PBEPBE/SDD
title: #p freq=noraman PBEPBE/SDD
converged: NO YES NO NO
title: Mulliken charges:
elementType: Cl O C C C C C C C C C C C C C H H H H H H H H H H H H H H H
charge: -0.068574 -0.484379 -0.172958 -0.172847 0.124062 -0.522502 -0.491847 -0.484190 -0.534383 0.455061 -0.367576 -0.390585 -0.241819 -0.206616 -0.111282 0.232259 0.223039 0.243696 0.203717 0.245208 0.237442 0.236587 0.247464 0.208692 0.244193 0.332922 0.221188 0.290660 0.251214 0.252155
chargesum: 0.00000
title: Mulliken charges with hydrogens summed into heavy atoms:
elementType: Cl O C C C C C C C C C C C C C
charge: -0.068574 -0.151457 0.059301 0.050192 0.124062 -0.075089 -0.009198 -0.000139 -0.081498 0.455061 -0.146388 -0.099926 0.009395 0.045539 -0.111282
polarizability: 2.00862295e+02 -1.73226429e-02 1.11565126e+02 4.10159965e-01 -3.53360806e+00 1.24969975e+02
1716.lowfreq: -4.4204 0.0008 0.0016 0.0020 10.8495 19.0886 32.8927 40.9301 55.2728
frequency: 32.3659 40.7077 55.1892 74.0971 128.3379 147.9792 151.7480 245.0393 261.1476 269.4889 302.4152 317.4428 353.2381 377.7654 394.7293 408.4087 432.9884 464.3505 502.8699 563.0288 625.5612 630.0472 705.1641 715.2518 771.9814 778.7827 802.9359 806.1423 823.2427 833.8192 848.5746 856.0536 903.5890 918.0544 944.5987 964.4021 978.9483 983.6677 1002.6494 1028.6951 1040.2372 1049.0727 1069.7576 1073.9440 1081.8276 1082.8579 1099.8535 1103.9019 1108.2721 1149.5002 1159.8662 1162.9915 1174.7181 1186.8913 1212.5313 1236.2780 1289.9666 1300.0197 1359.0503 1369.1936 1371.8895 1390.2377 1433.2707 1442.1991 1466.6994 1475.8053 1477.5582 1586.1251 1600.2590 3080.9502 3093.0453 3100.2462 3102.5500 3109.1013 3113.2580 3130.7003 3159.5228 3167.7891 3181.1613 3186.0220 3188.1955 3209.4279 3211.6588 3569.9190
redmass: 3.9425 3.4384 3.0933 3.6105 3.6507 3.3674 4.5545 4.8248 6.5889 5.0327 4.4142 4.2223 1.8061 3.4648 1.5859 2.8138 4.6537 5.8961 2.9865 2.6070 6.6604 2.9796 4.7128 3.7010 1.0825 1.1124 1.4160 1.5643 1.2937 1.4402 2.7128 2.6722 3.5252 3.7178 1.3748 3.4436 1.3992 2.4386 3.8444 2.9625 1.2411 1.2264 1.2765 2.6407 1.3206 1.4631 1.2159 1.1765 1.3330 1.7682 1.3937 1.4193 2.3969 1.1623 1.7575 2.0375 1.4993 1.5746 1.9028 1.9262 3.7742 3.3777 1.1009 1.0979 1.3158 2.3940 1.3252 7.8044 6.3069 1.0569 1.0529 1.0658 1.0604 1.0832 1.0883 1.0888 1.0900 1.0953 1.1139 1.0951 1.1155 1.1149 1.1153 1.0647
irintensity: 0.1291 0.0038 0.0275 0.2165 0.7172 0.0752 0.0430 0.4564 0.4225 20.8155 1.7059 10.8466 59.7115 0.8600 111.5430 5.2185 2.3242 33.1930 2.2704 33.7760 0.3095 1.1665 10.4163 2.4981 0.2899 1.7955 3.1633 7.9891 45.1740 3.4523 38.3868 19.9840 12.1125 54.4865 0.8690 34.2893 6.9006 28.3699 22.5167 27.0778 39.2433 26.2500 14.0271 32.2721 9.6983 0.1769 0.5424 5.3341 8.1990 41.4980 1.0758 0.7208 7.5261 0.2499 3.6347 1.1425 2.9954 19.5177 6.4248 1.7041 11.7991 10.0009 9.9720 9.1033 3.9238 84.6608 4.4573 1.8517 6.6666 21.3801 27.3796 17.4483 6.9692 2.9039 7.4787 16.1032 2.7107 4.7830 9.4841 1.3159 5.5732 19.2760 17.6829 1.7133
temp: 298.150 k
press: 1.00000 atm
elementType: 17 8 6 6 6 6 6 6 6 6 6 6 6 6 6 1 1 1 1 1 1 1 1 1 1 1 1 1 1 1
symmnumber: 1
zpe: 637632.5 jmol-1
zpe.correction: 0.242861 hartree
zpe.thermalcorrener: 0.257386 hartree
zpe.thermalcorrenthalpy: 0.258330 hartree
zpe.thermalcorrgfe: 0.200183 hartree
zpe.sumelectzpe: -1038.478771 hartree
zpe.sumelectthermal: -1038.464247 hartree
zpe.sumelectthermalent: -1038.463302 hartree
zpe.sumelectthermalfe: -1038.521449 hartree
dipole: -3.7717 0.0958 -1.2649
dipole: 3.9793
quadrupole: -99.8051 -98.2532 -89.1755
quadrupole: -0.2519 1.0735 -0.9568
quadrupole: -4.0605 -2.5086 6.5691 -0.2519 1.0735 -0.9568
hfenergy: -1038.7216323 hartree
pointgroup: C01 [X(C13H15Cl1O1)]
dipole: -1.4827503 0.1152326 -0.4890474 debye
polarizability: 200.8318019|1.3767584|113.5867179|1.0169836|-5.9255733|122.9788761 unknown
InChI: InChI=1S/C13H15ClO/c14-12-7-5-11(6-8-12)13(15,9-1-2-9)10-3-4-10/h5-10,15H,1-4H2
charge 0 multiplicity 1
30 atoms
Cl 4.960598 0.071999 -0.003467
O  -1.617111 -0.409651 1.456188
C  -1.710619 -1.122229 -0.921669
C  -1.801064 1.328565 -0.306459
C  -1.223013 -0.051281 0.081976
C  -3.026495 -1.888715 -0.72916
C  -1.675305 -2.608054 -0.565417
C  -1.655141 2.53881 0.614033
C  -3.046135 1.930083 0.367177
C  0.314126 -0.01206 0.079548
C  1.011023 0.391032 -1.087923
C  1.060833 -0.385345 1.221989
C  2.421497 0.418754 -1.123213
C  2.474538 -0.361198 1.206326
C  3.134131 0.039134 0.030736
H  -1.45917 -0.868278 -1.958577
H  -1.720743 1.529077 -1.381773
H  -3.630254 -2.098025 -1.616807
H  -3.624759 -1.724305 0.174266
H  -1.36969 -2.860251 0.454214
H  -1.365657 -3.323226 -1.332216
H  -1.417902 3.509929 0.170689
H  -1.20451 2.360019 1.595139
H  -3.517808 1.411871 1.208809
H  -3.754773 2.470609 -0.26661
H  -2.606545 -0.420934 1.494633
H  0.462139 0.696227 -1.986402
H  0.52723 -0.690287 2.124942
H  2.953905 0.729716 -2.026801
H  3.047375 -0.649085 2.092929
