program: Gaussian 09
title: 000005271
version: EM64L-G09RevD.01
frameworkgroup: C1[X(C21H29N3O4)]
method: RPBEPBE
basis: SDD
operation: Freq
keyword: #p
keyword: freq=noraman
keyword: PBEPBE/SDD
title: #p freq=noraman PBEPBE/SDD
converged: YES YES NO NO
title: Mulliken charges:
elementType: O O O O N N N C C C C C C C C C C C C C C C C C C C C C H H H H H H H H H H H H H H H H H H H H H H H H H H H H H
charge: -0.246886 -0.256686 -0.475608 -0.209812 -0.256452 -0.470892 -0.499588 -0.062118 -0.107831 -0.152781 -0.178115 -0.455000 -0.459864 -0.570153 -0.453459 -0.176889 -0.215805 -0.468638 0.289620 -0.373724 -0.484707 0.476714 0.207266 -0.448627 -0.346729 -0.197869 -0.211876 -0.263102 0.242368 0.188524 0.242281 0.289174 0.235721 0.211672 0.203351 0.239872 0.215216 0.217362 0.256594 0.194748 0.230498 0.272092 0.230783 0.347702 0.219421 0.201715 0.228811 0.219549 0.251400 0.270437 0.286267 0.209495 0.304757 0.389338 0.221513 0.223397 0.225554
chargesum: 0.00000
title: Mulliken charges with hydrogens summed into heavy atoms:
elementType: O O O O N N N C C C C C C C C C C C C C C C C C C C C C
charge: -0.246886 -0.256686 -0.086269 -0.209812 0.015639 -0.123190 -0.213320 0.180250 0.080694 0.089500 0.111059 -0.007607 -0.016641 -0.137575 -0.002118 0.053608 0.014977 -0.047503 0.289620 0.074636 0.037131 0.476714 0.207266 -0.239133 -0.041972 0.023645 0.011521 -0.037548
polarizability: 3.40015110e+02 -1.63150664e-01 2.74143700e+02 6.30347189e+00 -1.08553385e+01 1.79814033e+02
1716.lowfreq: -9.0442 -0.0007 0.0005 0.0005 1.2390 5.0298 8.1867 13.6483 19.9236
frequency: 6.3049 13.3986 19.8387 24.7528 37.5842 42.1512 44.2374 66.2356 75.4056 81.3694 84.4161 90.0038 107.6784 130.5950 148.3833 157.1507 166.8203 181.0221 206.1501 232.4388 243.5337 245.7230 279.1461 283.2814 313.7977 327.1234 335.6919 339.8789 400.1974 407.3035 423.9806 431.4230 455.8081 477.8370 490.8458 500.2623 522.3552 532.8400 537.7202 561.2982 584.4519 603.7033 613.2769 618.7351 636.4100 677.0769 696.3289 718.4992 736.1403 751.1314 756.7845 763.3684 775.1628 788.3864 803.6620 818.6399 831.2636 836.4740 837.3397 850.6089 869.1873 888.2969 905.4750 908.5846 914.4561 922.2103 948.8917 965.8875 967.6032 970.9967 980.2734 983.9712 990.9854 995.4518 1002.2405 1013.5301 1025.8357 1038.6364 1043.0839 1063.5148 1070.7932 1074.1293 1080.1606 1086.8060 1088.0001 1106.0212 1123.7514 1135.9415 1145.0018 1155.5832 1170.0252 1184.3024 1185.7266 1190.6886 1193.1764 1194.7786 1209.8218 1226.8742 1239.8373 1243.1026 1246.8193 1251.5825 1265.2125 1268.1294 1273.4989 1279.4036 1285.2068 1290.2564 1294.0386 1305.4661 1311.7734 1314.7684 1317.0844 1330.3256 1339.8327 1345.8893 1365.8638 1366.4621 1382.2431 1427.9518 1434.9633 1445.8454 1458.2776 1462.6029 1468.0077 1471.3349 1481.4812 1486.5706 1490.0958 1510.7392 1560.1943 1598.3118 1617.5068 1672.6670 1681.0233 1687.3423 2866.9400 2951.3900 2958.6168 2967.4311 2983.3350 2985.0428 3000.4554 3014.2235 3023.5692 3024.7448 3028.6224 3030.4601 3030.5887 3059.1861 3064.5329 3070.7212 3072.2295 3093.2817 3098.2685 3101.5778 3122.0979 3128.7697 3139.9643 3162.5885 3191.9933 3356.6925 3436.3172 3503.1542 3510.3642
redmass: 4.9852 5.6926 6.2825 5.1238 6.5589 4.0393 5.5145 5.9253 2.6833 5.6691 3.5914 4.0412 5.3004 3.1002 3.9759 3.6069 3.4942 2.8536 3.4098 3.4945 2.7173 2.9829 2.9768 2.5170 3.3078 4.3336 5.0086 2.8340 3.9398 2.9404 3.6130 3.6714 2.2768 1.9151 1.6525 1.9370 2.5710 1.7233 4.4546 3.5485 3.9376 3.8166 6.0079 1.3841 4.3458 1.4771 2.0564 2.9545 3.6977 1.4155 6.4585 1.7388 3.8571 2.0473 1.8765 2.2813 2.8507 2.2833 1.7435 1.9002 2.4834 3.0739 3.8944 1.4360 3.5891 2.4965 2.0668 1.3483 2.9348 3.7571 1.2208 5.8992 1.9310 1.3094 1.8736 1.9245 2.1475 2.5299 2.1218 2.2977 2.6538 2.0490 2.2360 1.7588 1.6508 2.4839 2.0697 1.3527 3.5553 1.5826 1.0512 1.4007 1.1136 1.3439 1.2287 1.2561 1.3154 1.2761 1.4801 1.4516 2.0178 1.4160 1.3384 1.3629 1.2495 1.3486 3.0050 1.2987 1.2993 1.3962 1.4437 1.4073 1.4971 1.3974 1.3603 1.4686 1.5513 1.6577 5.3874 2.4050 1.0837 1.1405 1.0927 1.0934 1.0837 1.0899 1.0975 2.3176 1.0906 2.1293 1.3725 5.2436 6.0382 4.7500 6.5068 8.0450 1.0709 1.0626 1.0829 1.0600 1.0847 1.0609 1.0640 1.0594 1.0948 1.0955 1.0674 1.0976 1.0854 1.0940 1.1005 1.0898 1.1040 1.1008 1.0941 1.0883 1.0929 1.0865 1.0932 1.0996 1.0951 1.0788 1.0760 1.0639 1.0755
irintensity: 0.0987 0.3909 2.1513 1.2966 1.3528 0.2037 1.7978 0.9832 0.4382 4.8844 0.1024 1.2711 2.5848 0.8657 0.9366 8.6525 2.3129 0.4448 0.4549 0.9735 0.6115 1.7177 4.8568 7.2073 1.4550 7.1502 0.5398 6.5747 4.1234 0.0418 6.4112 20.3723 6.5506 13.1859 62.7296 16.1569 10.7661 10.5912 9.1904 14.5056 7.5744 5.7935 5.1080 119.5371 19.8435 143.9278 71.3990 20.5187 4.2776 16.3637 7.8607 96.2145 15.2301 8.1595 2.3253 2.6770 0.1245 1.0418 1.2278 22.3999 18.5296 19.1925 5.1554 14.1666 11.6907 17.8692 5.7880 0.1873 3.7147 2.6683 24.8656 0.2607 109.2715 3.0776 16.8178 31.1994 11.5641 101.5823 38.0603 51.5860 9.1951 2.8814 9.7814 6.7151 25.6055 0.6641 12.5502 23.8525 271.6088 11.9598 0.9783 7.9822 8.9630 1.6387 7.0520 19.9211 9.9702 2.8968 11.0861 4.0810 130.2610 51.6169 1.6706 1.1315 2.3162 2.9975 9.5170 0.9922 10.3795 7.8121 44.9407 5.7190 73.3193 4.2651 5.8094 1.5098 5.5947 30.7802 100.1026 82.8075 33.5073 44.2789 9.2123 14.3192 4.3312 15.3976 16.4189 68.1155 8.8065 467.1691 134.7352 33.7102 99.4645 211.2376 3.6517 215.7599 111.7889 35.8235 23.4686 37.2965 16.0682 9.5173 18.7637 33.8565 21.4469 20.0343 36.7384 0.8788 40.3509 9.6281 8.6846 80.5437 0.9285 34.0719 58.5890 22.1644 7.8399 0.2177 35.7892 28.7289 8.9893 186.2686 4.8275 26.4818 10.4194
temp: 298.150 k
press: 1.00000 atm
elementType: 8 8 8 8 7 7 7 6 6 6 6 6 6 6 6 6 6 6 6 6 6 6 6 6 6 6 6 6 1 1 1 1 1 1 1 1 1 1 1 1 1 1 1 1 1 1 1 1 1 1 1 1 1 1 1 1 1
symmnumber: 1
zpe: 1244074.4 jmol-1
zpe.correction: 0.473843 hartree
zpe.thermalcorrener: 0.501643 hartree
zpe.thermalcorrenthalpy: 0.502587 hartree
zpe.thermalcorrgfe: 0.409835 hartree
zpe.sumelectzpe: -1280.628742 hartree
zpe.sumelectthermal: -1280.600942 hartree
zpe.sumelectthermalent: -1280.599998 hartree
zpe.sumelectthermalfe: -1280.692750 hartree
dipole: 4.3513 5.4390 -1.1065
dipole: 7.0527
quadrupole: -153.6564 -183.0740 -167.3006
quadrupole: -9.1777 4.4255 -10.7998
quadrupole: 14.3540 -15.0637 0.7097 -9.1777 4.4255 -10.7998
hfenergy: -1281.1025848 hartree
pointgroup: C01 [X(C21H29N3O4)]
dipole: 1.9324483 1.8914391 -0.622384 debye
polarizability: 339.2849203|-7.5831748|272.6967544|2.4171755|-18.5481831|181.9911679 unknown
InChI: InChI=1S/C21H29N3O4/c25-20(26)11-7-2-1-6-10-16-17(19-13-12-18(16)28-19)14-22-24-21(27)23-15-8-4-3-5-9-15/h1,3-6,8-9,16-19,22-25H,2,7,10-14H2
charge 0 multiplicity 1
57 atoms
O  2.385674 -3.85789 -0.443881
O  -2.535236 -1.639973 0.946324
O  -0.739474 3.128044 0.216589
O  0.582321 4.827075 1.081837
N  0.124377 -0.618969 0.789073
N  -1.022663 0.10242 0.430471
N  -3.257836 0.344048 -0.130374
C  3.44048 -1.789451 -0.84862
C  2.333143 -1.574423 0.250636
C  3.756349 -3.307088 -0.67202
C  2.11445 -3.028242 0.777862
C  4.467987 -3.603733 0.678956
C  3.290089 -3.432114 1.708172
C  4.647878 -0.81916 -0.771467
C  1.053395 -0.940148 -0.315913
C  4.307733 0.574147 -1.261447
C  4.400601 1.721897 -0.53864
C  4.087103 3.109757 -1.065546
C  -2.292494 -0.504771 0.459159
C  2.964951 3.840393 -0.278276
C  1.599362 3.142834 -0.431517
C  -4.665562 0.167374 -0.178094
C  0.500808 3.812447 0.364058
C  -5.428938 1.17433 -0.833423
C  -5.331217 -0.951618 0.393528
C  -6.832045 1.068877 -0.914696
C  -6.737271 -1.038861 0.305331
C  -7.499293 -0.039651 -0.343122
H  2.969547 -1.680355 -1.846447
H  2.724891 -0.922314 1.060998
H  4.190943 -3.795653 -1.556375
H  1.098412 -3.239673 1.136934
H  4.85403 -4.636442 0.685086
H  5.315113 -2.923599 0.873702
H  3.498477 -2.667801 2.478142
H  3.06735 -4.383602 2.218577
H  5.466673 -1.229154 -1.401352
H  5.036904 -0.769437 0.263656
H  0.556284 -1.652509 -1.000337
H  1.329429 -0.037909 -0.917062
H  3.966462 0.639118 -2.308529
H  0.573645 -0.254208 1.638785
H  4.742967 1.668268 0.508161
H  -0.926675 1.088196 0.140092
H  5.001248 3.735494 -1.008634
H  3.813168 3.048372 -2.137805
H  2.886726 4.886053 -0.629339
H  3.232174 3.893793 0.79427
H  1.285494 3.115174 -1.494133
H  1.669114 2.083292 -0.1162
H  -2.905733 1.173384 -0.615448
H  -4.920611 2.038974 -1.281904
H  -4.741602 -1.729492 0.882032
H  -1.425509 3.597283 0.766361
H  -7.40278 1.853312 -1.424733
H  -7.240819 -1.905745 0.748577
H  -8.589496 -0.12307 -0.405235
