program: Gaussian 09
title: 000044106
version: EM64L-G09RevD.01
frameworkgroup: C1[X(C19H16O2)]
method: RPBEPBE
basis: SDD
operation: Freq
keyword: #pfreq=noraman
keyword: PBEPBE/SDD
title: #p freq=noraman PBEPBE/SDD
converged: YES YES NO NO
title: Mulliken charges:
elementType: O O C C C C C C C C C C C C C C C C C C C H H H H H H H H H H H H H H H H
charge: -0.438232 -0.423018 0.069530 -0.250675 0.254114 0.300594 0.413172 -0.251055 0.069364 -0.747573 0.248469 0.484747 -0.444416 -0.493751 -0.372975 -0.208825 -0.832157 -0.407023 -0.465868 -0.259464 -0.250434 0.230547 0.230710 0.268320 0.250117 0.232060 0.233873 0.231444 0.237997 0.237587 0.237485 0.224452 0.250435 0.346524 0.337082 0.226685 0.230156
chargesum: 0.00000
title: Mulliken charges with hydrogens summed into heavy atoms:
elementType: O O C C C C C C C C C C C C C C C C C C C
charge: -0.091707 -0.085936 0.069530 -0.020128 0.254114 0.300594 0.413172 -0.020345 0.069364 -0.479253 0.248469 0.484747 -0.194298 -0.261691 -0.139102 0.022619 -0.119088 -0.182570 -0.215433 -0.032779 -0.020277
polarizability: 3.76591772e+02 2.84698515e+01 2.42752601e+02 -5.93465988e+00 -1.79167941e+00 1.04100669e+02
1716.lowfreq: -8.0797 -1.5574 0.0006 0.0010 0.0010 5.5875 44.5770 48.8653 72.1893
frequency: 44.5079 48.8379 72.1851 84.5347 125.3278 131.9880 135.8036 178.7359 201.8915 242.5235 256.3870 271.2573 281.3537 295.3449 325.1882 334.2083 348.2116 378.1750 430.1855 439.1894 459.4606 486.4829 498.1894 524.3912 528.1436 553.1121 569.9329 580.8901 599.0010 628.1406 651.3749 680.8836 737.5733 749.7195 757.7672 774.5605 784.2646 821.6022 833.6923 845.9368 859.6355 872.0070 875.1940 915.1616 925.5953 931.7628 959.1147 965.0805 973.0757 989.2434 989.8707 1016.9540 1028.3213 1037.9635 1054.9923 1065.4513 1118.2302 1160.7236 1162.0953 1179.5290 1184.0544 1190.2787 1209.5352 1214.7339 1239.2359 1249.0375 1272.9867 1287.1156 1311.1567 1337.5725 1350.5812 1358.3283 1372.5796 1382.5653 1402.7136 1409.1744 1421.2800 1431.9547 1440.5911 1460.3249 1471.1958 1480.9387 1502.3044 1542.5224 1560.8674 1583.7225 1609.9026 1630.0322 1657.4460 2968.9141 2981.4114 3027.0950 3049.9931 3116.3057 3119.1223 3122.0207 3126.1506 3133.9436 3150.8926 3153.4745 3159.5346 3163.7315 3167.5361 3533.3664 3555.2500
redmass: 4.4703 4.6773 4.6414 2.0303 4.5649 2.5257 1.9648 4.3873 4.6226 2.2999 1.4015 1.1893 4.0591 4.1095 4.0759 4.4607 4.1333 4.2332 3.6816 4.7320 4.4488 4.3894 4.6567 3.1121 3.8842 4.7739 4.3073 4.6764 4.3026 4.5925 5.7788 4.0348 5.3107 1.4244 1.8522 3.0569 2.2326 2.6231 3.5952 1.7464 1.7193 3.8549 3.8401 3.9722 2.4442 2.8276 5.1908 1.4072 1.3605 1.3563 1.3464 2.4226 3.1531 1.6045 2.8327 1.8754 2.1931 1.1291 1.4818 1.2507 1.1717 1.1580 1.6154 1.6912 1.5506 1.7117 2.2424 2.0190 1.2687 1.3700 2.7884 2.0009 2.1314 2.1306 1.2592 2.5829 1.9780 3.6731 7.3269 2.9243 1.5931 1.0631 1.7261 5.2077 8.4835 5.6646 6.5762 6.1602 7.0152 1.0835 1.0419 1.0845 1.0971 1.0876 1.0927 1.0866 1.0882 1.0889 1.0908 1.0941 1.0976 1.0946 1.0984 1.0662 1.0665
irintensity: 1.1934 0.5326 0.4952 0.6370 0.2772 1.1819 0.0343 3.3743 0.1902 7.9546 3.4154 288.7109 2.0657 2.2650 7.3387 16.4825 14.7822 1.4342 4.8995 2.3936 0.1320 3.3040 0.6464 10.4279 6.0980 2.2137 2.6906 12.8201 1.9352 7.6787 4.0001 9.0406 4.2137 34.9991 33.1728 3.6630 6.7212 1.8442 24.6716 30.4783 20.6973 8.0198 7.8102 25.9493 60.5511 32.4571 71.4221 5.7974 0.5252 0.8658 1.1643 10.7070 13.7649 1.8597 2.3234 1.1385 2.0382 14.0854 8.1125 12.8276 49.8668 14.8000 11.2557 4.5019 3.7610 9.3593 1.0729 8.0716 4.7305 40.2968 6.5501 13.3744 1.3530 0.4119 18.0659 7.3415 6.2329 0.2162 4.0517 6.6153 4.6983 12.5463 6.3987 16.1453 2.8515 1.6647 7.3629 3.2678 2.6198 32.5404 31.7662 20.6056 17.0531 11.7449 17.2333 2.1814 10.7567 4.0308 1.1797 34.6578 26.5829 24.2259 48.5531 3.1702 9.0828
temp: 298.150 k
press: 1.00000 atm
elementType: 8 8 6 6 6 6 6 6 6 6 6 6 6 6 6 6 6 6 6 6 6 1 1 1 1 1 1 1 1 1 1 1 1 1 1 1 1
symmnumber: 1
zpe: 770780.5 jmol-1
zpe.correction: 0.293575 hartree
zpe.thermalcorrener: 0.311052 hartree
zpe.thermalcorrenthalpy: 0.311996 hartree
zpe.thermalcorrgfe: 0.248791 hartree
zpe.sumelectzpe: -882.606574 hartree
zpe.sumelectthermal: -882.589097 hartree
zpe.sumelectthermalent: -882.588153 hartree
zpe.sumelectthermalfe: -882.651357 hartree
dipole: -0.7531 0.9955 -0.8457
dipole: 1.5078
quadrupole: -109.8839 -106.0111 -130.0287
quadrupole: -1.3070 -6.2207 -5.0843
quadrupole: 5.4240 9.2968 -14.7208 -1.3070 -6.2207 -5.0843
hfenergy: -882.9001488 hartree
pointgroup: C01 [X(C19H16O2)]
dipole: 0.2740955 0.4057937 0.3347962 debye
polarizability: 378.9937193|-22.3463263|240.4651675|-2.4784832|0.7757894|103.9861547 unknown
InChI: InChI=1S/C19H16O2/c1-11-14-5-3-2-4-13(14)10-16-15(11)8-6-12-7-9-17(20)19(21)18(12)16/h2-10,17,19-21H,1H3
charge 0 multiplicity 1
37 atoms
O  -2.127248 -1.974653 1.528393
O  -3.919806 -1.715954 -1.716524
C  -1.595575 -0.037637 0.082225
C  -2.265246 -1.398635 0.157298
C  -0.151339 0.073055 0.04528
C  0.472354 1.394415 -0.010152
C  -2.397139 1.117243 0.112257
C  -3.762801 -1.443431 -0.263442
C  1.896161 1.532825 -0.07338
C  0.685355 -1.067934 0.079966
C  2.721643 0.363257 -0.058097
C  2.092777 -0.954577 0.031709
C  -0.395158 2.547658 0.01757
C  -1.773495 2.414826 0.090145
C  -3.864586 1.01684 0.153667
C  -4.520368 -0.166111 -0.007459
C  2.491758 2.931019 -0.14706
C  4.165008 0.404266 -0.114719
C  2.920143 -2.13518 0.070261
C  4.931739 -0.756789 -0.07993
C  4.30514 -2.046328 0.015754
H  -1.732683 -2.127864 -0.478886
H  -4.204767 -2.277622 0.322835
H  0.246523 -2.065538 0.177375
H  0.041981 3.54962 -0.010956
H  -2.41246 3.3057 0.115765
H  -4.429928 1.94705 0.292307
H  -5.613879 -0.217948 -0.021353
H  2.088175 3.492824 -1.0099
H  2.255777 3.515918 0.762524
H  3.585404 2.922474 -0.250901
H  4.679815 1.36637 -0.18536
H  2.427506 -3.111916 0.144095
H  -2.255839 -1.243309 2.185594
H  -3.699771 -2.670006 -1.880222
H  6.024539 -0.690626 -0.12438
H  4.923391 -2.950001 0.045099
