program: Gaussian 09
title: 000044060
version: EM64L-G09RevD.01
frameworkgroup: C1[X(C19H26N2)]
method: RPBEPBE
basis: SDD
operation: Freq
keyword: #pfreq=noraman
keyword: PBEPBE/SDD
title: #p freq=noraman PBEPBE/SDD
converged: YES YES NO NO
title: Mulliken charges:
elementType: N N C C C C C C C C C C C C C C C C C C C H H H H H H H H H H H H H H H H H H H H H H H H H H
charge: -0.278668 -0.087425 -0.360932 -0.435980 -0.382595 0.512604 0.454242 -0.364377 -0.358308 -0.384180 -0.418508 -0.456125 -0.400069 -0.230430 -0.249317 -0.227851 -0.232195 -0.247167 -0.245161 -0.617889 -0.613666 0.208228 0.224271 0.192899 0.164633 0.236714 0.232788 0.228587 0.179160 0.158717 0.230520 0.243289 0.247961 0.230948 0.234656 0.222998 0.222612 0.223824 0.223155 0.226781 0.226773 0.222398 0.183513 0.225424 0.228682 0.184869 0.219597
chargesum: 0.00000
title: Mulliken charges with hydrogens summed into heavy atoms:
elementType: N N C C C C C C C C C C C C C C C C C C C
charge: -0.045880 -0.087425 -0.152704 -0.018810 0.018752 0.512604 0.454242 0.043369 0.030928 -0.140891 -0.170548 -0.225176 -0.165413 -0.007432 -0.026705 -0.004026 -0.009040 -0.020386 -0.018388 0.013446 0.019483
polarizability: 2.36801212e+02 -1.73490561e+01 2.23481119e+02 3.80017074e+00 -1.57992320e+01 1.81244664e+02
1716.lowfreq: -8.7725 -3.6863 -0.0004 -0.0002 0.0004 1.8816 14.1739 25.0357 26.5801
frequency: 12.8954 24.9785 26.3129 31.1343 36.8069 55.2477 66.4614 80.9813 106.4873 123.0238 141.2807 172.8590 182.4661 209.8734 217.5844 223.2054 239.2185 259.7984 290.7426 333.2738 356.3178 376.8361 402.3540 403.1324 439.5625 461.6384 472.1188 499.2258 564.0944 582.7431 614.2833 617.2863 631.0076 688.3338 703.8858 705.5442 734.0154 761.1885 780.3348 805.4420 819.3635 833.6158 849.9834 853.1303 854.0008 920.6093 924.5074 975.3702 976.3571 985.6773 990.6494 992.4796 993.6190 995.5472 1010.8191 1026.6173 1028.2235 1032.9596 1038.5174 1049.2101 1058.5578 1075.4425 1080.0941 1091.8569 1095.9692 1110.1395 1134.6004 1145.1882 1159.4272 1170.8521 1171.6442 1187.7804 1190.4306 1192.2177 1203.5059 1211.3204 1237.6336 1251.1396 1264.0465 1278.5429 1293.5416 1295.6796 1307.1055 1322.4402 1335.5224 1339.2848 1365.8634 1379.7083 1383.8389 1395.9772 1418.6020 1436.5095 1440.0236 1440.6318 1451.9892 1460.7843 1461.7440 1464.3970 1474.2012 1476.3648 1480.2855 1483.8767 1484.2272 1488.1285 1497.4078 1589.9466 1592.8457 1609.0709 1614.1740 2807.7390 2828.4662 2837.9821 2855.9337 2868.8556 2961.9069 2968.0029 3017.8600 3018.0491 3026.3934 3029.5437 3045.2452 3049.6394 3077.8522 3086.5061 3111.6298 3114.3558 3119.7276 3122.9975 3132.0697 3136.7270 3142.8597 3148.8751 3161.0436 3162.4242 3412.5489
redmass: 3.4660 3.6126 3.0575 3.8283 4.0455 4.3256 3.9344 1.7626 3.5698 3.1878 2.1088 4.4104 2.8314 1.7700 3.3943 1.1079 1.9210 3.0958 4.3089 2.8344 3.2892 2.4930 2.8112 2.8120 2.9268 2.9678 3.3880 3.4577 3.3218 3.4313 5.7647 6.2750 4.4226 1.3175 1.7616 1.6709 2.6025 1.6442 2.0152 1.3560 2.7452 1.9302 1.8901 1.2535 1.4596 1.4272 1.5410 1.3944 1.4062 3.5139 5.7451 1.7650 1.3533 2.1908 2.7493 2.2145 2.2273 1.4675 2.0219 2.4961 2.3364 1.8535 1.6908 1.3676 1.8355 1.8899 1.3654 3.5420 1.5654 1.0620 1.0524 1.1173 2.2853 1.1863 2.1020 1.7346 1.3813 1.5835 2.4264 1.3177 1.2125 1.2470 1.3945 1.3595 1.2724 1.3302 1.4397 6.3481 6.9576 1.4594 1.1460 2.2148 1.1791 2.0845 1.2164 1.0513 1.0908 1.0702 1.0769 1.0598 2.2210 1.7804 1.1927 1.0899 1.0804 6.0505 6.0007 6.0779 6.0497 1.0705 1.0717 1.0579 1.0577 1.0704 1.0824 1.0624 1.0720 1.0850 1.0716 1.0850 1.0998 1.0904 1.1007 1.0998 1.0870 1.0864 1.0859 1.0864 1.0910 1.0923 1.0959 1.0946 1.1014 1.1011 1.0737
irintensity: 0.2541 0.0421 0.3333 0.0386 0.1157 0.0831 0.0153 2.0389 0.4864 0.7717 2.7205 0.0843 2.5922 0.3517 0.4640 1.1962 1.0449 0.3741 0.8518 8.8659 0.1599 3.0129 0.2852 0.0180 2.6357 5.5938 5.4707 7.0909 14.3452 13.1600 2.0698 1.2626 5.2178 83.3445 44.3773 64.2593 14.3018 49.1003 22.6336 10.0627 7.1061 3.9174 1.8679 0.1055 1.2831 2.3917 3.1276 0.0469 0.2604 4.3699 0.4038 3.3468 0.4953 4.4347 7.6594 9.0757 4.6686 9.3427 33.9531 11.2344 36.0342 8.3161 2.1066 15.4559 10.8429 9.6917 1.7634 70.0051 6.4706 0.1151 0.0978 0.5162 0.0839 1.0599 2.0494 4.3084 7.3508 2.5811 14.7658 4.8002 8.6902 1.0431 3.7546 8.6456 1.1275 1.1181 3.1270 0.4441 0.5070 5.2449 3.1082 9.5518 1.0890 7.8944 40.7765 12.2527 5.0438 4.6916 6.9611 18.6312 24.5360 30.6736 3.3068 6.0626 4.4904 3.7321 0.0487 14.4639 6.4167 92.6086 90.8855 77.2765 230.2542 125.6062 17.2574 34.8128 37.6924 13.8398 56.6308 12.7287 44.4749 37.5676 37.1612 45.6696 9.9103 6.9029 1.7285 0.1475 12.0782 23.1675 40.6886 40.8509 29.2927 19.4911 2.3512
temp: 298.150 k
press: 1.00000 atm
elementType: 7 7 6 6 6 6 6 6 6 6 6 6 6 6 6 6 6 6 6 6 6 1 1 1 1 1 1 1 1 1 1 1 1 1 1 1 1 1 1 1 1 1 1 1 1 1 1
symmnumber: 1
zpe: 1064228.0 jmol-1
zpe.correction: 0.405343 hartree
zpe.thermalcorrener: 0.426934 hartree
zpe.thermalcorrenthalpy: 0.427878 hartree
zpe.thermalcorrgfe: 0.350473 hartree
zpe.sumelectzpe: -847.510209 hartree
zpe.sumelectthermal: -847.488618 hartree
zpe.sumelectthermalent: -847.487674 hartree
zpe.sumelectthermalfe: -847.565079 hartree
dipole: -0.5646 -0.9204 -0.8829
dipole: 1.3948
quadrupole: -121.4460 -122.5968 -121.9956
quadrupole: 4.1841 2.5214 -2.6353
quadrupole: 0.5668 -0.5840 0.0172 4.1841 2.5214 -2.6353
hfenergy: -847.9155521 hartree
pointgroup: C01 [X(C19H26N2)]
dipole: -0.2121687 -0.3649273 -0.3506344 debye
polarizability: 237.6240704|-16.9871762|222.863736|4.2217979|-15.4424627|181.0391881 unknown
InChI: InChI=1S/C19H26N2/c1-21(2)16-15-20-14-13-19(17-9-5-3-6-10-17)18-11-7-4-8-12-18/h3-12,19-20H,13-16H2,1-2H3
charge 0 multiplicity 1
47 atoms
N  -2.492619 -0.830363 0.016563
N  -6.26531 -0.346875 0.074596
C  1.284269 -0.232874 -0.634414
C  -0.012838 -0.848829 -0.036853
C  -1.296938 -0.152699 -0.526852
C  1.448328 1.233863 -0.200014
C  2.549037 -1.05232 -0.325491
C  -3.780985 -0.188422 -0.324839
C  -4.936294 -0.922987 0.384534
C  1.854589 1.559017 1.120225
C  2.599645 -2.047614 0.682661
C  1.166694 2.291411 -1.100681
C  3.730364 -0.792485 -1.070605
C  1.96843 2.905088 1.529935
C  3.794058 -2.762059 0.938445
C  1.282263 3.641618 -0.695779
C  4.922913 -1.503363 -0.82147
C  1.682059 3.953444 0.623229
C  4.960287 -2.494486 0.188475
C  -6.748296 -0.682948 -1.280121
C  -7.273092 -0.671578 1.104728
H  1.160953 -0.230257 -1.738199
H  0.004369 -0.797393 1.068141
H  -0.055453 -1.923513 -0.312431
H  -1.291247 -0.111962 -1.648493
H  -1.309968 0.896276 -0.175482
H  -2.497779 -1.831673 -0.229268
H  -3.759565 0.857651 0.032196
H  -3.963797 -0.14853 -1.427792
H  -4.891505 -2.017918 0.130531
H  -4.763212 -0.843284 1.472743
H  2.098086 0.753198 1.823004
H  1.706458 -2.276317 1.273316
H  0.855088 2.056287 -2.126519
H  3.711749 -0.017922 -1.847785
H  2.28558 3.138391 2.552933
H  3.811182 -3.527797 1.722706
H  1.061416 4.445861 -1.407034
H  5.821227 -1.286677 -1.410954
H  1.77352 4.998378 0.940383
H  5.884742 -3.048881 0.385587
H  -7.70321 -0.161444 -1.47229
H  -6.919435 -1.781956 -1.42386
H  -6.023424 -0.3484 -2.041213
H  -6.921724 -0.325377 2.092753
H  -7.498639 -1.766698 1.180836
H  -8.218778 -0.147485 0.875622
