program: Gaussian 09
title: 000005156
version: EM64L-G09RevD.01
frameworkgroup: C1[X(C15H18O3)]
method: RPBEPBE
basis: SDD
operation: Freq
keyword: #pfreq=noraman
keyword: PBEPBE/SDD
title: #p freq=noraman PBEPBE/SDD
converged: NO YES NO NO
title: Mulliken charges:
elementType: O O O C C C C C C C C C C C C C C C H H H H H H H H H H H H H H H H H H
charge: -0.211575 -0.192751 -0.235126 -0.151464 -0.359936 0.117180 -0.469200 0.503463 -0.486342 -0.213757 0.164018 -0.732834 -0.169832 -0.024211 -0.737841 -0.393352 0.055942 -0.835791 0.257120 0.270087 0.223961 0.235284 0.227187 0.216101 0.261803 0.212217 0.268566 0.242657 0.238019 0.236055 0.217007 0.249414 0.257463 0.287684 0.228634 0.244149
chargesum: 0.00000
title: Mulliken charges with hydrogens summed into heavy atoms:
elementType: O O O C C C C C C C C C C C C C C C
charge: -0.211575 -0.192751 -0.235126 0.105657 -0.089850 0.117180 -0.009956 0.503463 -0.043054 0.048046 0.164018 -0.009394 0.068187 -0.024211 -0.035365 -0.135888 0.055942 -0.075324
polarizability: 2.23688990e+02 -1.58232481e+01 1.57623704e+02 -6.91152971e+00 4.93707248e+00 1.20599970e+02
1716.lowfreq: -6.3350 -0.0010 -0.0008 -0.0004 9.7991 15.3787 45.0359 68.7459 86.8552
frequency: 44.9485 68.7455 86.8475 106.3436 130.4953 143.1386 180.1687 195.5171 201.3409 218.0186 239.3120 242.2574 272.8292 283.0944 313.7177 318.6681 354.4085 358.7609 421.0478 454.0484 473.4034 486.9848 493.4320 520.7597 575.4235 579.6613 647.0419 656.6111 684.8807 699.8148 721.0710 743.7091 762.7775 790.1132 822.9506 837.2141 854.9175 897.4988 920.1001 922.6799 956.0528 968.0569 996.5638 997.6994 1017.1803 1028.4953 1037.8754 1056.8722 1063.1977 1089.1742 1102.4212 1134.4591 1145.8475 1148.3319 1167.8439 1177.3079 1197.0857 1198.9715 1231.4538 1269.9345 1280.0431 1302.6234 1307.0344 1321.9294 1329.6155 1340.6709 1348.4702 1371.6654 1381.2940 1391.1877 1395.7811 1400.4529 1457.3892 1463.8867 1464.9524 1468.7065 1474.8630 1484.1803 1488.6886 1490.8875 1548.0925 1609.0664 1653.0333 1698.4885 2951.1467 2976.9924 2980.8899 2988.5945 2994.2467 2997.1242 3015.3819 3032.9452 3037.5258 3054.1438 3065.9087 3086.6659 3093.0679 3093.8926 3098.8630 3100.7967 3117.9990 3154.3638
redmass: 5.6949 4.6045 3.9633 3.0605 1.2487 3.2262 1.7586 1.1492 2.0100 3.2019 2.6687 2.9776 2.9304 3.9379 2.1888 3.7430 3.7985 4.1196 3.4137 4.5794 3.0795 3.9532 4.0628 3.6112 5.7594 5.0526 5.0509 3.4696 3.8597 4.5459 2.9467 3.9258 4.4633 3.4173 2.5078 1.9782 3.4749 2.4588 2.0514 2.4029 2.1846 1.6797 1.6753 1.3359 2.0751 1.9658 1.5498 2.2046 2.1931 2.1271 2.0028 2.3618 1.8832 1.8861 1.9123 2.1382 1.9227 1.7979 1.5049 1.3130 1.3805 2.1512 1.5635 1.5693 1.4619 1.3831 1.7852 1.5948 2.0409 1.2702 1.2728 1.1986 1.0750 1.0582 1.0741 1.0845 1.0479 1.0572 1.0597 1.0639 8.8125 8.3288 7.6624 12.2518 1.0809 1.0597 1.0397 1.0377 1.0590 1.0386 1.0857 1.0876 1.0993 1.1015 1.0938 1.0984 1.1003 1.0882 1.0995 1.0995 1.0987 1.0969
irintensity: 2.9254 2.7803 1.9747 1.7336 1.9003 0.8123 0.6080 0.3420 3.2616 2.4331 0.8760 2.6286 1.3914 2.9612 1.5724 0.7150 3.2974 8.3310 0.9850 5.0247 0.6382 4.4989 5.6355 0.1128 11.7970 0.5602 0.4905 1.1155 2.2695 4.4861 3.2178 0.9576 7.0736 2.7170 40.4135 28.2738 87.0768 34.5921 4.9452 30.6512 9.1528 3.6699 21.9835 2.6223 103.3230 33.4273 4.0703 44.3568 31.0911 32.0900 41.1432 21.8426 9.3536 14.6148 40.3221 1.4539 23.0857 6.6015 5.4944 0.8785 3.3345 16.3861 4.5361 3.6165 5.4011 7.6053 0.8595 9.9634 16.8110 33.4791 12.1588 21.9871 3.9390 1.6206 43.4394 10.6110 6.9888 14.8238 19.9143 7.2026 171.9357 5.9041 62.3806 318.8536 13.1705 28.9304 18.0678 25.3463 12.7903 36.5947 4.8912 33.7726 13.8573 43.6035 13.3730 11.5521 17.8658 20.0466 22.8808 2.0401 10.5322 14.4118
temp: 298.150 k
press: 1.00000 atm
elementType: 8 8 8 6 6 6 6 6 6 6 6 6 6 6 6 6 6 6 1 1 1 1 1 1 1 1 1 1 1 1 1 1 1 1 1 1
symmnumber: 1
zpe: 777711.0 jmol-1
zpe.correction: 0.296214 hartree
zpe.thermalcorrener: 0.312900 hartree
zpe.thermalcorrenthalpy: 0.313844 hartree
zpe.thermalcorrgfe: 0.253061 hartree
zpe.sumelectzpe: -806.719010 hartree
zpe.sumelectthermal: -806.702324 hartree
zpe.sumelectthermalent: -806.701380 hartree
zpe.sumelectthermalfe: -806.762164 hartree
dipole: -2.1630 3.7489 -4.0055
dipole: 5.8971
quadrupole: -132.1172 -100.6848 -110.5561
quadrupole: 5.4209 14.2750 6.1824
quadrupole: -17.6645 13.7679 3.8966 5.4209 14.2750 6.1824
hfenergy: -807.0152246 hartree
pointgroup: C01 [X(C15H18O3)]
dipole: -0.7931137 -1.588551 1.4934556 debye
polarizability: 223.010162|17.1695281|157.7376347|6.5009191|7.1294891|121.1648674 unknown
InChI: InChI=1S/C15H18O3/c1-8-10-4-6-15(3)7-5-11(16)9(2)12(15)13(10)18-14(8)17/h5,7-8,10,13H,4,6H2,1-3H3
charge 0 multiplicity 1
36 atoms
O  -1.414527 1.013415 -0.937399
O  -3.66144 1.058558 -1.533034
O  4.241359 1.308463 0.240752
C  -1.58954 -0.241377 1.120308
C  -0.645944 0.726099 0.348096
C  0.89548 -1.232382 -0.369393
C  -1.440584 -1.703344 0.642043
C  0.751282 0.227022 0.058096
C  0.037429 -2.137175 0.585937
C  -2.977301 0.382477 0.791191
C  -2.796247 0.846897 -0.668741
C  0.412549 -1.406299 -1.858494
C  2.325553 -1.717945 -0.338979
C  1.828526 1.068387 0.240499
C  -4.235698 -0.476648 0.993316
C  3.3981 -0.906516 -0.12825
C  3.229633 0.540602 0.115976
C  1.718223 2.541694 0.595874
H  -1.36277 -0.182314 2.201287
H  -0.597598 1.692587 0.880007
H  -1.901586 -1.828763 -0.356479
H  -1.994673 -2.371544 1.327265
H  0.480405 -2.097452 1.601287
H  0.110421 -3.186625 0.240368
H  -3.084087 1.313779 1.390419
H  0.45619 -2.473791 -2.145024
H  -0.614164 -1.036246 -2.000312
H  1.067364 -0.834082 -2.537402
H  2.468103 -2.788058 -0.549435
H  -4.170511 -1.430966 0.44383
H  -4.392992 -0.699992 2.063358
H  -5.120081 0.063095 0.613282
H  4.428182 -1.2794 -0.148948
H  2.699904 3.015613 0.432503
H  1.461383 2.69079 1.662535
H  0.962257 3.061139 -0.01694
