program: Gaussian 09
title: 000005138
version: EM64L-G09RevD.01
frameworkgroup: C1[X(C8H10N2S)]
method: RPBEPBE
basis: SDD
operation: Freq
keyword: #p
keyword: freq=noraman
keyword: PBEPBE/SDD
title: #p freq=noraman PBEPBE/SDD
converged: YES YES NO NO
title: Mulliken charges:
elementType: S N N C C C C C C C C H H H H H H H H H H
charge: 0.144553 -0.604285 -0.311005 0.473432 -0.790095 -0.376898 -0.376854 -0.221987 -0.221991 -0.237728 -0.089187 0.294215 0.294179 0.238060 0.238064 0.225856 0.225856 0.228224 0.317719 0.327559 0.222314
chargesum: 0.00000
title: Mulliken charges with hydrogens summed into heavy atoms:
elementType: S N N C C C C C C C C
charge: 0.144553 0.040993 -0.088692 0.473432 -0.201701 -0.138838 -0.138790 0.003869 0.003865 -0.009504 -0.089187
polarizability: 1.77706342e+02 3.63157275e-03 9.27278010e+01 1.00830168e+01 2.72469091e-04 8.49003315e+01
1716.lowfreq: -25.9827 -10.2055 -8.3458 -7.3141 -0.0019 0.0006 0.0025 28.2111 47.5193
frequency: -23.1142 27.2054 47.2342 69.5372 160.0004 233.9118 312.5115 327.9751 361.5571 389.0120 402.0505 448.7368 480.2465 556.8312 558.6633 592.7728 616.4538 659.7218 702.0954 735.7927 777.9069 808.6756 851.3349 884.8778 925.5805 976.0083 989.5829 990.9608 995.3133 1025.4420 1039.7192 1072.0217 1118.7524 1172.1692 1186.5432 1217.0518 1240.6965 1282.2791 1323.0284 1383.7908 1439.2236 1443.8237 1482.7095 1592.7145 1609.1514 1613.8841 1634.2836 3056.4709 3120.8491 3123.5857 3131.6465 3136.3549 3147.2034 3163.8984 3351.0950 3526.4275 3675.3976
redmass: 4.1756 4.0518 5.9078 5.1848 6.4288 4.9352 1.9663 1.1083 3.9723 1.2604 2.7969 6.3293 3.6898 5.3398 3.3214 3.0726 6.3342 4.8767 1.6217 1.3827 2.2294 3.8936 1.2502 1.5418 1.4623 1.3917 4.0479 2.1352 1.3289 2.1937 1.4947 1.4660 1.0889 1.0525 1.1127 1.8240 1.6869 2.7204 1.2827 8.8723 2.2037 1.1112 2.3638 6.1185 1.5635 5.6175 2.5967 1.0582 1.0848 1.0886 1.1077 1.0922 1.0966 1.1017 1.0767 1.0446 1.1045
irintensity: 0.1075 5.7540 10.9763 2.4723 5.7140 0.2572 0.0542 14.7879 1.2555 302.9671 0.2595 6.5155 6.2082 6.2202 16.5518 89.5293 0.2118 29.0135 64.5113 83.0137 25.6858 10.1243 0.0078 0.8245 2.9890 0.0042 42.2389 136.0532 0.7636 6.3972 11.7469 10.2494 0.8614 0.0250 1.0590 1.3038 68.0816 172.4606 0.2340 0.0697 8.3693 8.8029 12.8805 0.8636 136.3908 0.3192 252.2052 5.5588 4.8725 0.2140 2.2871 16.1588 43.9972 23.1801 25.9938 31.1422 18.4699
temp: 298.150 k
press: 1.00000 atm
elementType: 16 7 7 6 6 6 6 6 6 6 6 1 1 1 1 1 1 1 1 1 1
symmnumber: 1
zpe: 431808.6 jmol-1
zpe.correction: 0.164467 hartree
zpe.thermalcorrener: 0.174980 hartree
zpe.thermalcorrenthalpy: 0.175924 hartree
zpe.thermalcorrgfe: 0.126696 hartree
zpe.sumelectzpe: -817.595978 hartree
zpe.sumelectthermal: -817.585466 hartree
zpe.sumelectthermalent: -817.584521 hartree
zpe.sumelectthermalfe: -817.633749 hartree
dipole: 2.0735 0.0023 -1.1596
dipole: 2.3757
quadrupole: -45.7158 -69.8910 -75.6711
quadrupole: 0.0106 -3.3803 0.0015
quadrupole: 18.0435 -6.1317 -11.9118 0.0106 -3.3803 0.0015
hfenergy: -817.7604455 hartree
pointgroup: C01 [X(C8H10N2S1)]
dipole: 0.8065978 -0.0012268 0.4722392 debye
dipolederiv: -0.837988 0.0001691 0.048345 0.0001676 -0.1283204 0.0000399 0.1042427 0.0000464 -0.1947675 -1.0721761 0.0006285 -0.5359518 0.0005461 -0.6937098 0.0001776 -0.3661653 0.0001279 -0.7123632 -0.3707628 -0.0001125 0.0205991 -0.0005828 -0.4446107 0.000797 0.4923752 0.0006281 -1.2468547 0.2191491 -0.0000184 0.0003166 0.0000673 -0.0150401 0.0000984 -0.0568213 0.0000948 -0.0805478 0.5238223 -0.0001445 0.1240798 -0.0002484 0.1069648 -0.0002036 0.2929375 -0.0002133 0.1938441 -0.0938606 0.0784861 -0.0329726 0.0482664 0.0471285 -0.0177917 -0.0111549 -0.0128759 -0.1359711 -0.0938383 -0.0784255 -0.0331135 -0.0483021 0.0470127 0.0181172 -0.0111788 0.0132156 -0.1359054 -0.0375932 -0.0899745 -0.0351734 -0.1095425 0.0803707 0.0171973 -0.0269382 0.0241365 -0.1360184 -0.0376013 0.0900123 -0.035003 0.1095432 0.0804882 -0.0168115 -0.0267673 -0.0237674 -0.1360923 0.0497879 0.000085 -0.0724039 0.0000776 -0.0566205 0.00008 -0.0559666 0.0000791 -0.1489993 1.6295063 -0.0008468 0.1670122 -0.0005179 0.0713006 -0.0014066 -0.4227058 -0.0012588 1.4346062 0.0039079 0.0013732 -0.0172359 0.0378013 -0.0101402 -0.0624107 -0.0791999 -0.0497241 -0.0018535 0.003792 -0.0013296 -0.0172534 -0.0376596 -0.0104227 0.0624508 -0.0792458 0.0497734 -0.0016665 0.0484272 -0.0990234 0.034653 -0.0901325 -0.0451122 0.0180219 0.0285405 0.0243799 0.1320801 0.0483981 0.0989614 0.0348385 0.0901023 -0.044993 -0.0183423 0.0287139 -0.0246959 0.1319913 0.0200448 0.0881135 0.0283315 0.1079362 -0.0764395 -0.0216532 0.037327 -0.0215988 0.1494722 0.0200876 -0.0881329 0.0281679 -0.1079824 -0.0765511 0.0212476 0.0371224 0.0211933 0.1495481 -0.1292515 -0.0000789 0.0677358 -0.0000847 0.0870814 -0.0000448 0.0711529 -0.0000437 0.1435978 0.1024314 0.0000949 0.0357537 0.0001732 0.3906873 0.0002423 0.0261934 0.0002386 0.1505019 0.2372465 0.0000431 0.048985 0.0000281 0.4088759 0.0003008 0.0595993 0.0002719 0.1479352 -0.2335292 0.0001199 0.1402896 0.0003437 0.28205 -0.0001064 -0.0420608 -0.0000074 0.2974627 unknown
polarizability: 178.0680189|-0.0155562|92.7278027|-8.2444163|0.0045463|84.5386533 unknown
InChI: InChI=1S/C8H10N2S/c9-8(10)11-6-7-4-2-1-3-5-7/h1-5,9H,6,10H2
charge 0 multiplicity 1
21 atoms
S  1.666039 -0.000807 0.859547
N  4.34984 -0.002361 1.044593
N  3.450808 0.000302 -1.223722
C  -0.860385 0.000498 -0.351258
C  0.600614 0.000972 -0.730422
C  -1.561097 1.221582 -0.170703
C  -1.560846 -1.221056 -0.172937
C  -2.930881 1.222763 0.174089
C  -2.930625 -1.223162 0.171863
C  -3.620214 -0.000429 0.346491
C  3.345135 -0.000893 0.077502
H  0.906182 -0.890917 -1.296969
H  0.906136 0.894136 -1.294979
H  -1.027534 2.170667 -0.301859
H  -1.027084 -2.169788 -0.305832
H  -3.459576 2.173516 0.306313
H  -3.459114 -2.174267 0.302362
H  -4.683336 -0.000778 0.612384
H  5.328325 -0.002567 0.763447
H  4.129431 -0.003395 2.038936
H  4.424081 0.000086 -1.585245
