program: Gaussian 09
title: 000044092
version: EM64L-G09RevD.01
frameworkgroup: C1[X(C16H17N5O5)]
method: RPBEPBE
basis: SDD
operation: Freq
keyword: #p
keyword: freq=noraman
keyword: PBEPBE/SDD
title: #p freq=noraman PBEPBE/SDD
converged: YES YES NO NO
title: Mulliken charges:
elementType: O O O O O N N N N N C C C C C C C C C C C C C C C C H H H H H H H H H H H H H H H H H
charge: -0.423585 -0.205614 -0.178755 -0.211876 -0.205400 -0.142865 -0.090212 -0.090793 0.012952 0.017100 -0.445648 -0.399117 0.457820 -0.320273 -0.335747 -0.322772 -0.653923 -0.365612 -0.292994 0.133454 0.110312 0.306284 -0.256582 0.431227 -0.494771 -0.376966 0.226509 0.252248 0.235938 0.225936 0.198073 0.247627 0.246219 0.237558 0.220820 0.243451 0.226951 0.255873 0.285313 0.341667 0.330263 0.278795 0.291115
chargesum: 0.00000
title: Mulliken charges with hydrogens summed into heavy atoms:
elementType: O O O O O N N N N N C C C C C C C C C C C C C C C C
charge: -0.081918 -0.205614 -0.178755 -0.211876 -0.205400 -0.142865 -0.090212 -0.090793 0.012952 0.017100 0.033109 0.062757 0.457820 0.125426 -0.089527 -0.085214 0.037300 -0.109740 -0.007681 0.133454 0.110312 0.306284 0.022213 0.431227 -0.164508 -0.085851
polarizability: 7.63950766e+02 -2.02808303e+01 2.37345085e+02 -3.16880915e+00 -1.10684737e+01 1.27598198e+02
1716.lowfreq: -7.5582 -2.0748 -0.0008 0.0005 0.0009 3.5332 13.4522 20.6676 30.1926
frequency: 12.1284 20.6148 30.1899 44.0345 53.0334 55.5544 62.9699 63.6674 91.8083 103.6807 116.8353 122.2783 137.8573 151.6185 173.2393 195.9983 209.3674 232.4658 259.4432 277.9276 291.5178 306.1478 317.4535 331.5718 337.5930 369.1878 377.8068 399.3940 412.8068 435.6870 445.8371 489.1334 504.9567 510.4529 532.8981 550.2099 568.7438 603.1788 628.5122 640.7309 652.4229 670.8988 708.8899 719.9820 740.6587 752.7395 753.3145 791.6397 797.3672 805.4116 808.0985 835.1644 840.6335 876.7180 884.3976 898.7145 952.9775 967.4598 969.7669 984.2762 985.7943 994.7214 995.4308 1020.6955 1048.5463 1052.7742 1077.2432 1105.3083 1107.6330 1127.3823 1130.5760 1153.5760 1175.4423 1193.6373 1203.1248 1206.2304 1211.4112 1244.0566 1272.4612 1283.9844 1285.5168 1303.6628 1311.9365 1336.6236 1344.4837 1348.7269 1349.3791 1359.7815 1373.8634 1380.5719 1389.7157 1391.9643 1405.1318 1434.8053 1452.2810 1466.1065 1468.9931 1476.6361 1481.3295 1491.6652 1503.6598 1518.2403 1540.7429 1565.9131 1598.2992 1624.6859 2972.3334 2988.8557 3001.3732 3008.7843 3055.4240 3063.8724 3087.0976 3095.9327 3097.0915 3152.1265 3155.0990 3164.1793 3173.7132 3178.3389 3185.9609 3191.7563 3569.1232
redmass: 5.7236 6.9363 7.8988 6.4473 7.4569 7.9795 4.3244 7.4572 3.5816 4.4782 3.3387 4.2874 4.9152 5.7821 7.0073 6.0519 1.7686 1.8862 2.1854 3.3444 1.8510 3.7581 5.4539 10.0887 6.5746 5.4661 5.0430 4.7134 3.6696 3.9832 3.7569 4.1557 8.3899 3.2336 3.2232 4.0921 3.7630 5.9052 7.0273 6.8061 7.0560 9.8632 6.5869 4.5553 4.5221 12.6741 4.8594 1.1616 2.5964 1.5199 1.3114 1.8059 2.0217 2.8562 7.5875 2.3516 1.4452 2.6475 1.6535 2.3609 1.5819 2.5557 1.3421 3.9810 2.1693 1.6491 1.9933 1.6607 3.2731 1.6354 1.5288 1.8156 1.7999 3.1861 2.5117 5.1713 1.9971 1.6546 1.3419 1.2209 3.2247 1.1812 1.3994 2.1969 1.5605 3.4528 2.3945 11.0867 3.6162 1.2955 6.2351 1.2760 1.9574 6.6088 2.9356 1.9174 1.0884 1.3774 1.0869 1.1351 1.4952 1.9058 5.7288 9.2401 7.1829 6.4363 1.0689 1.0357 1.0622 1.0611 1.1022 1.0991 1.1001 1.0995 1.1000 1.0884 1.0870 1.0887 1.0958 1.0959 1.0961 1.0926 1.0666
irintensity: 1.4757 0.1320 1.3522 1.8769 0.2014 0.1402 0.2532 1.5584 1.3194 1.0411 2.3446 14.7787 0.6858 2.4752 0.7388 4.0997 3.5991 2.5799 18.3724 42.6997 123.2766 6.1309 41.6890 5.3415 6.8955 1.4253 4.3515 9.1057 8.5162 8.3116 2.0319 2.8451 3.3040 9.8011 21.0876 24.1387 2.3117 1.0414 1.1513 12.8459 9.4245 28.1128 9.7703 13.9327 2.5232 14.2229 23.8425 12.8954 34.7786 3.1692 8.1472 28.8058 62.5781 33.0207 59.5679 16.2727 25.4127 122.9920 41.8026 0.3126 13.2802 93.5511 0.9198 49.5010 58.5265 13.0911 54.5279 44.2100 14.2528 119.6856 255.0199 501.0306 28.3819 567.7525 291.4939 592.2323 6.1951 155.5543 107.1384 11.3564 3.1334 8.5188 25.9132 930.9070 175.0625 84.0687 178.6638 96.5113 26.5931 6.1083 120.6745 20.1004 107.6257 12.7302 20.6022 5.3965 7.5698 2.5340 0.5680 27.1344 44.3343 53.4994 90.4952 26.7833 404.7913 529.5756 43.6381 28.1990 55.8621 89.5461 5.7724 7.3120 36.0522 2.3147 77.2731 2.3434 5.8054 1.5331 11.1441 25.5960 0.8205 19.8180 20.8761
temp: 298.150 k
press: 1.00000 atm
elementType: 8 8 8 8 8 7 7 7 7 7 6 6 6 6 6 6 6 6 6 6 6 6 6 6 6 6 1 1 1 1 1 1 1 1 1 1 1 1 1 1 1 1 1
symmnumber: 1
zpe: 842266.0 jmol-1
zpe.correction: 0.320802 hartree
zpe.thermalcorrener: 0.345468 hartree
zpe.thermalcorrenthalpy: 0.346412 hartree
zpe.thermalcorrgfe: 0.262615 hartree
zpe.sumelectzpe: -1267.656862 hartree
zpe.sumelectthermal: -1267.632197 hartree
zpe.sumelectthermalent: -1267.631252 hartree
zpe.sumelectthermalfe: -1267.715049 hartree
dipole: -15.5000 -0.5217 2.6295
dipole: 15.7301
quadrupole: -148.4239 -161.0710 -155.4122
quadrupole: -17.5021 -11.3372 3.5289
quadrupole: 6.5451 -6.1020 -0.4431 -17.5021 -11.3372 3.5289
hfenergy: -1267.9776643 hartree
pointgroup: C01[X(C16H17N5O5)]
dipole: 6.1184138 0.8171215 -0.4441553 debye
polarizability: 764.1801227|-18.8520848|127.6890298|1.2770711|-8.7142893|237.0248963 unknown
InChI: InChI=1S/C16H17N5O5/c1-2-19(9-10-22)13-5-3-12(4-6-13)17-18-15-8-7-14(20(23)24)11-16(15)21(25)26/h3-8,11,22H,2,9-10H2,1H3
charge 0 multiplicity 1
43 atoms
O  7.508374 -1.416729 -2.411439
O  -3.773194 -0.337918 3.343446
O  -1.932443 -1.323503 2.41382
O  -6.995663 1.172001 -1.89831
O  -7.464138 0.550106 0.250494
N  5.324462 0.29404 0.188467
N  -0.251597 -0.142075 -0.700629
N  -1.070107 0.087777 0.306368
N  -3.01047 -0.618291 2.33488
N  -6.64004 0.768666 -0.721011
C  6.277008 0.157478 -0.931045
C  5.909075 0.57554 1.522575
C  3.950985 0.193538 -0.008377
C  6.663153 -1.318194 -1.217853
C  3.401325 -0.142755 -1.294949
C  3.026618 0.413341 1.077306
C  5.968931 2.082662 1.858349
C  2.020217 -0.246332 -1.475364
C  1.650454 0.309427 0.888499
C  1.114937 -0.015526 -0.398303
C  -2.437322 0.132425 -0.013651
C  -3.413466 -0.103295 1.009401
C  -2.914233 0.56508 -1.290671
C  -5.201469 0.545883 -0.477183
C  -4.783591 0.121198 0.797906
C  -4.277404 0.760716 -1.531484
H  7.187729 0.735519 -0.682825
H  5.865338 0.60267 -1.853579
H  5.343587 0.0262 2.295999
H  6.930696 0.153719 1.531645
H  7.148865 -1.770905 -0.327846
H  5.764519 -1.908525 -1.457651
H  4.056696 -0.337894 -2.147331
H  3.398688 0.67005 2.072524
H  6.573728 2.630074 1.113189
H  4.960686 2.531137 1.871556
H  6.428756 2.234957 2.851702
H  1.602443 -0.511327 -2.452196
H  0.954623 0.464849 1.7188
H  8.418902 -1.084449 -2.209737
H  -5.506869 -0.04385 1.600148
H  -2.168432 0.745815 -2.070333
H  -4.652059 1.079602 -2.507705
