program: Gaussian 09
title: 000044036
version: EM64L-G09RevD.01
frameworkgroup: C1[X(C16H20ClN)]
method: RPBEPBE
basis: SDD
operation: Freq
keyword: #p
keyword: freq=noraman
keyword: PBEPBE/SDD
title: #p freq=noraman PBEPBE/SDD
converged: YES YES NO NO
title: Mulliken charges:
elementType: Cl N C C C C C C C C C C C C C C C C H H H H H H H H H H H H H H H H H H H H
charge: -0.066330 -0.298635 -0.247349 -0.291266 -0.472423 -0.477605 -0.464452 -0.460240 0.282445 0.167935 -0.566474 0.335265 -0.404564 -0.412034 -0.630529 -0.234434 -0.223937 -0.116510 0.252421 0.231378 0.224511 0.212747 0.209759 0.228778 0.207522 0.222033 0.229147 0.209219 0.236650 0.214862 0.258693 0.255227 0.241437 0.223472 0.193228 0.225079 0.253078 0.251897
chargesum: 0.00000
title: Mulliken charges with hydrogens summed into heavy atoms:
elementType: Cl N C C C C C C C C C C C C C C C C
charge: -0.066330 -0.039942 0.005072 -0.059889 -0.035164 -0.039068 -0.034898 -0.021874 0.282445 0.167935 -0.114961 0.335265 -0.149337 -0.170597 0.011249 0.018644 0.027960 -0.116510
polarizability: 2.64345366e+02 -3.88109092e-01 1.68108439e+02 -3.43510828e+00 1.65197237e+01 1.39256043e+02
1716.lowfreq: -11.9081 -9.5137 -0.0002 0.0007 0.0023 1.0742 36.1096 41.1299 60.7020
frequency: 36.0430 40.7691 60.7000 70.9631 82.0287 108.1477 129.7166 147.3154 195.1928 217.1985 227.4689 236.4963 263.1330 288.0747 301.4295 321.9447 378.9545 414.0982 427.7177 460.3946 491.2186 506.7073 547.6923 593.7783 623.0914 648.0781 668.0102 703.5963 724.8327 740.9188 781.9674 792.1656 804.5779 825.2203 827.9081 850.8583 869.5334 870.4749 937.3241 944.9398 949.9385 959.8383 961.5335 980.2635 1000.3889 1031.0249 1037.0817 1041.7049 1052.2345 1073.5562 1101.0273 1103.2569 1118.5420 1132.7840 1141.7488 1151.0266 1155.4742 1171.5331 1185.4778 1194.4573 1222.3817 1226.1049 1251.1669 1255.5365 1258.9289 1268.5215 1292.6302 1302.6842 1306.5273 1334.7860 1337.9108 1351.4528 1353.7250 1369.0748 1393.8047 1433.6197 1442.1880 1459.5992 1464.1504 1469.8940 1471.5326 1473.2630 1475.7756 1487.5057 1494.5007 1568.8052 1593.4564 1638.2063 2874.0105 2892.5712 2953.8533 2977.8833 2979.6341 2994.9106 2996.1102 3011.3689 3029.9172 3031.6497 3034.1743 3055.2115 3057.2137 3062.7784 3074.8199 3135.0316 3144.0599 3165.5727 3169.4706 3448.9464
redmass: 4.2713 3.9324 3.1515 3.3688 3.1231 2.1717 2.1652 4.0545 3.7936 5.1775 1.8471 2.0007 1.9350 2.9183 4.4732 3.6558 3.0544 2.9484 3.8959 4.4486 4.0971 4.1086 3.4315 4.8335 6.9130 6.3832 1.4327 3.8671 3.8178 4.2394 2.8930 1.3294 2.0069 1.3396 1.5332 2.4198 2.2584 2.2933 1.7766 1.8063 1.6191 1.6694 1.4010 4.6505 3.5629 2.5884 1.8202 2.7182 2.5511 2.5830 1.3729 1.5979 1.8855 1.5817 1.1014 3.2820 1.1862 1.4368 1.1301 1.9651 1.1446 1.2328 1.4528 1.6058 1.5421 1.8080 1.2661 1.2908 1.4965 1.4039 1.7268 2.3806 1.5153 2.9372 3.4765 1.1454 1.1928 1.0760 1.0658 1.0877 1.0873 1.0825 2.3126 1.1136 1.0469 7.4420 6.2429 8.0472 1.0560 1.0633 1.0930 1.0591 1.0592 1.0627 1.0627 1.0758 1.1025 1.0897 1.0990 1.1041 1.0881 1.1028 1.0992 1.0890 1.0883 1.0957 1.0970 1.0747
irintensity: 0.4531 0.1316 1.0978 0.1064 2.1155 1.9506 0.2430 0.9192 0.3656 0.2507 1.9425 0.4836 0.3427 2.7403 1.3814 1.5002 6.8070 0.1367 2.3509 13.3256 13.6435 4.9004 4.3000 6.3337 0.2948 8.8737 99.0926 14.0738 9.3348 4.7207 3.6388 2.4276 6.8307 17.1839 40.7690 7.8736 5.6863 8.5474 1.2512 0.7169 0.7452 16.2652 1.4438 24.9913 21.2538 5.2895 1.4878 8.1255 0.4035 42.1331 1.8401 5.0491 12.7687 1.5728 1.3196 47.3257 11.6194 2.2679 0.9347 3.0275 0.0555 1.3767 8.0135 0.4019 0.8683 0.3453 1.9954 0.0899 3.2139 3.6103 6.5730 1.4870 4.1233 1.3396 2.8099 1.2061 25.1969 0.0596 14.1974 5.3248 14.3040 4.6872 100.5964 2.3605 14.5635 1.0675 3.7470 14.7235 126.4201 85.2110 37.3640 49.6918 11.2836 79.8575 81.4369 52.3281 2.7160 39.7574 12.5105 47.9042 43.3422 73.6609 37.3370 9.6220 8.3731 10.2811 0.3656 0.3986
temp: 298.150 k
press: 1.00000 atm
elementType: 17 7 6 6 6 6 6 6 6 6 6 6 6 6 6 6 6 6 1 1 1 1 1 1 1 1 1 1 1 1 1 1 1 1 1 1 1 1
symmnumber: 1
zpe: 842114.2 jmol-1
zpe.correction: 0.320744 hartree
zpe.thermalcorrener: 0.337718 hartree
zpe.thermalcorrenthalpy: 0.338662 hartree
zpe.thermalcorrgfe: 0.274987 hartree
zpe.sumelectzpe: -1135.150343 hartree
zpe.sumelectthermal: -1135.133370 hartree
zpe.sumelectthermalent: -1135.132426 hartree
zpe.sumelectthermalfe: -1135.196100 hartree
dipole: -2.2834 0.1070 -0.3211
dipole: 2.3083
quadrupole: -129.6645 -108.5321 -110.3829
quadrupole: 0.3625 0.1115 3.5791
quadrupole: -13.4713 7.6610 5.8103 0.3625 0.1115 3.5791
hfenergy: -1135.4710873 hartree
pointgroup: C01 [X(C16H20Cl1N1)]
dipole: 0.891988 -0.1316183 -0.1085946 debye
polarizability: 263.8801099|-6.6961607|159.6481195|2.5756438|-21.4464144|148.1816177 unknown
InChI: InChI=1S/C16H20ClN/c1-18-10-15-11-2-4-12(5-3-11)16(15)13-6-8-14(17)9-7-13/h6-9,11-12,18H,2-5,10H2,1H3
charge 0 multiplicity 1
38 atoms
Cl -5.729554 0.131763 -0.01894
N  1.861154 -2.845176 0.062404
C  2.763263 0.005327 0.250998
C  1.082083 1.782843 -0.585993
C  3.105037 0.375696 -1.229242
C  2.918738 1.301769 1.109804
C  2.073389 1.431503 -1.741895
C  1.914312 2.382775 0.595147
C  1.311247 -0.451574 0.326397
C  0.40748 0.500258 -0.089243
C  1.011424 -1.865723 0.785024
C  -1.073038 0.395006 -0.066151
C  -1.769394 -0.173513 1.039935
C  -1.853201 0.900987 -1.145939
C  1.736735 -4.232661 0.545414
C  -3.178368 -0.259095 1.062493
C  -3.261736 0.820856 -1.143701
C  -3.905537 0.235274 -0.03635
H  3.433927 -0.796605 0.602942
H  0.336523 2.5235 -0.927263
H  3.087787 -0.536401 -1.852715
H  4.136158 0.776717 -1.269461
H  3.962188 1.663407 1.031955
H  2.734697 1.067534 2.174216
H  2.5854 2.355701 -2.072925
H  1.510217 1.04237 -2.61037
H  1.231685 2.708083 1.401003
H  2.447899 3.28378 0.235962
H  -0.076476 -2.089425 0.681511
H  1.255653 -1.971396 1.864825
H  1.722224 -2.772981 -0.95418
H  -1.204599 -0.512989 1.914234
H  -1.352374 1.346118 -2.012938
H  2.372927 -4.896431 -0.066449
H  0.694838 -4.637369 0.5277
H  2.097931 -4.294263 1.589257
H  -3.698674 -0.688827 1.923556
H  -3.845965 1.202862 -1.986021
