program: Gaussian 09
title: 000044073
version: EM64L-G09RevD.01
frameworkgroup: C1[X(C14H7ClF3NO5)]
method: RPBEPBE
basis: SDD
operation: Freq
keyword: #p
keyword: freq=noraman
keyword: PBEPBE/SDD
title: #p freq=noraman PBEPBE/SDD
converged: YES YES NO NO
title: Mulliken charges:
elementType: Cl F F F O O O O O N C C C C C C C C C C C C C C H H H H H H H
charge: 0.015135 -0.161769 -0.160896 -0.160460 -0.269566 -0.402330 -0.210289 -0.194982 -0.185319 0.024162 0.486242 0.370572 0.305185 0.281587 -0.491697 0.264495 -0.325343 -0.319654 -0.326819 -0.333349 -0.367120 -0.320174 0.269162 0.096428 0.305313 0.281404 0.292100 0.272265 0.279407 0.290902 0.395410
chargesum: 0.00000
title: Mulliken charges with hydrogens summed into heavy atoms:
elementType: Cl F F F O O O O O N C C C C C C C C C C C C C C
charge: 0.015135 -0.161769 -0.160896 -0.160460 -0.269566 -0.006920 -0.210289 -0.194982 -0.185319 0.024162 0.486242 0.370572 0.305185 0.281587 -0.186385 0.264495 -0.325343 -0.038250 -0.034718 -0.061084 -0.087713 -0.029273 0.269162 0.096428
polarizability: 2.95256208e+02 7.55009938e-01 1.84716086e+02 -1.83511594e+01 -3.92784696e+00 1.31654334e+02
1716.lowfreq: -9.3807 -4.2379 -0.0022 -0.0021 -0.0019 2.2555 12.4461 15.2448 23.4171
frequency: 12.3887 15.1672 23.3564 25.0929 31.3262 84.1928 89.1503 97.7217 129.9209 134.4084 147.0810 168.1500 178.7372 191.6053 243.9785 266.1780 274.4686 307.2510 321.3996 350.3575 360.2093 365.1712 391.7784 425.5476 438.6401 445.8749 464.2436 479.2009 525.5263 533.8897 566.9473 593.2609 598.2448 605.2546 618.1187 639.6168 659.6530 663.2445 675.4024 711.1812 729.5585 742.3941 756.6855 775.3086 829.7390 834.0837 851.0743 897.0376 906.2124 913.5634 965.0593 980.8504 988.3569 1020.3759 1026.2898 1032.0000 1045.3644 1067.0568 1134.7593 1146.8241 1158.5636 1192.1051 1216.1230 1237.2201 1250.1207 1266.5595 1288.6254 1309.3704 1369.5940 1374.6511 1398.1062 1402.5122 1412.9269 1470.6505 1483.0144 1577.1723 1590.9720 1602.1655 1614.9164 1651.9047 3159.2646 3169.5134 3174.5635 3177.6402 3180.5712 3191.4058 3523.6607
redmass: 13.7635 13.6085 9.8365 11.3927 14.1082 9.0083 8.5526 11.2959 6.2273 15.7643 6.0712 11.5122 7.1734 10.6383 10.7012 10.0549 8.4878 9.6718 9.8422 7.9075 9.2760 7.8900 9.6200 6.2586 3.6796 4.2148 7.3586 7.8637 3.6891 5.1960 2.6861 7.0191 5.5263 3.1051 6.5511 4.3111 5.2942 7.7888 6.5210 6.3348 5.2071 7.0678 4.9245 9.8877 5.1399 1.5587 1.4875 1.4407 1.7075 3.8937 1.3699 1.3485 10.3667 7.7782 4.1339 6.8503 3.4038 2.8227 2.0468 1.3357 1.3497 2.7458 8.2629 2.4759 1.9342 1.5652 2.8353 2.5963 7.9717 7.3542 4.4598 11.3841 4.3095 3.0031 3.0298 8.2322 7.4278 7.4928 6.8298 10.0584 1.0893 1.0924 1.0894 1.0936 1.0968 1.0976 1.0643
irintensity: 0.5572 0.2643 1.1207 0.4483 1.3562 0.6206 2.5878 1.2262 1.4525 2.2940 0.7073 1.3751 1.5354 4.0308 1.5664 1.5876 2.5932 4.5090 6.7033 2.3586 2.3290 7.7262 1.9125 2.5631 18.5105 4.0648 4.7712 1.7178 6.0150 8.3452 52.7110 16.3151 30.2721 68.8683 2.6463 23.3635 1.2871 11.1554 5.5494 29.3441 5.2037 52.3633 9.9459 19.9486 12.9941 59.5870 30.1420 41.5401 38.3380 63.4991 6.4524 0.9713 249.5886 347.0571 75.8196 59.1320 113.8204 48.4995 17.7683 25.5709 13.8732 46.0608 677.9275 48.7389 268.4335 97.8617 370.0983 113.7815 133.6766 51.1409 26.6331 37.9246 44.0533 58.2025 64.8794 8.4739 228.0338 91.9878 2.5589 210.1229 3.0741 1.9146 0.1738 1.1247 1.6370 2.5006 54.2713
temp: 298.150 k
press: 1.00000 atm
elementType: 17 9 9 9 8 8 8 8 8 7 6 6 6 6 6 6 6 6 6 6 6 6 6 6 1 1 1 1 1 1 1
symmnumber: 1
zpe: 496087.9 jmol-1
zpe.correction: 0.188950 hartree
zpe.thermalcorrener: 0.210300 hartree
zpe.thermalcorrenthalpy: 0.211244 hartree
zpe.thermalcorrgfe: 0.133606 hartree
zpe.sumelectzpe: -1726.356312 hartree
zpe.sumelectthermal: -1726.334962 hartree
zpe.sumelectthermalent: -1726.334018 hartree
zpe.sumelectthermalfe: -1726.411656 hartree
dipole: -1.1419 0.8557 -2.5117
dipole: 2.8888
quadrupole: -187.2306 -133.3886 -147.5729
quadrupole: -3.1855 -4.9127 1.8203
quadrupole: -31.1666 22.6754 8.4911 -3.1855 -4.9127 1.8203
hfenergy: -1726.5452617 hartree
pointgroup: C01 [X(C14H7Cl1F3N1O5)]
dipole: 0.4610133 0.5921916 0.853513 debye
polarizability: 293.9170544|-1.5740965|182.9957396|-23.4586027|-10.1634268|134.7138353 unknown
InChI: InChI=1S/C14H7ClF3NO5/c15-10-5-7(14(16,17)18)1-4-12(10)24-8-2-3-11(19(22)23)9(6-8)13(20)21/h1-6,20H
charge 0 multiplicity 1
31 atoms
Cl 2.106255 2.729362 -2.218428
F  5.153726 -2.104184 0.715165
F  5.90615 -0.833377 -1.014736
F  6.09676 -0.085337 1.114058
O  0.184012 1.900865 -0.089977
O  -3.454146 -2.648778 0.714598
O  -2.448592 -2.608866 -1.38689
O  -5.927641 0.563721 1.07807
O  -5.445139 -1.066002 -0.448259
N  -5.107423 -0.089334 0.325492
C  1.373634 1.150428 -0.03337
C  -1.08068 1.306339 0.080252
C  3.876017 -0.131814 0.116088
C  -2.665695 -0.543282 -0.100781
C  -1.35209 -0.045268 -0.233877
C  -3.692098 0.342869 0.311251
C  2.402063 1.484298 -0.947025
C  1.609405 0.175934 0.96455
C  3.653475 0.849405 -0.876055
C  2.857925 -0.467722 1.038617
C  -2.1048 2.177851 0.516263
C  -3.417142 1.691377 0.626856
C  5.227405 -0.779547 0.224118
C  -2.865827 -2.009926 -0.374592
H  -0.564252 -0.715048 -0.589853
H  0.82225 -0.061461 1.686133
H  4.436932 1.106208 -1.593993
H  3.038587 -1.224163 1.807266
H  -1.859774 3.21892 0.741171
H  -4.2394 2.338588 0.942258
H  -3.625396 -3.604652 0.496131
