program: Gaussian 09
title: 000044144
version: EM64L-G09RevD.01
frameworkgroup: C1[X(C20H19N3O4)]
method: RPBEPBE
basis: SDD
operation: Freq
keyword: #p
keyword: freq=noraman
keyword: PBEPBE/SDD
title: #p freq=noraman PBEPBE/SDD
converged: YES YES NO NO
title: Mulliken charges:
elementType: O O O O N N N C C C C C C C C C C C C C C C C C C C C H H H H H H H H H H H H H H H H H H H
charge: -0.267811 -0.232554 -0.226839 -0.235133 -0.124812 -0.255043 -0.380686 0.353794 0.046851 0.066379 0.453722 -0.651019 -0.794644 -0.359078 -0.382552 -0.213235 -0.210022 0.061800 -0.248427 0.134441 -0.354406 0.369088 -0.368191 -0.399143 -0.226817 -0.215435 -0.239246 0.243655 0.271991 0.255136 0.234069 0.333516 0.236286 0.385890 0.283016 0.262801 0.231611 0.230090 0.232657 0.248845 0.249217 0.228124 0.288015 0.227137 0.228083 0.228879
chargesum: 0.00000
title: Mulliken charges with hydrogens summed into heavy atoms:
elementType: O O O O N N N C C C C C C C C C C C C C C C C C C C C
charge: -0.267811 -0.232554 -0.226839 -0.235133 -0.124812 -0.255043 0.005204 0.353794 0.046851 0.066379 0.453722 0.119763 0.009226 -0.076062 -0.119751 0.018376 0.020068 0.061800 -0.015771 0.134441 0.143656 0.369088 -0.140067 -0.111128 0.000321 0.012649 -0.010367
polarizability: 4.36690945e+02 -1.10808845e+01 2.57925362e+02 9.10558373e+00 1.54586023e+01 1.29699125e+02
1716.lowfreq: -0.0006 0.0007 0.0009 1.2140 2.4638 6.5858 9.1891 11.8497 28.1421
frequency: 9.1277 11.7014 28.1245 31.5556 37.1594 55.5199 58.9420 73.3079 90.1671 115.7865 130.5125 149.8489 166.9181 169.6265 190.7891 194.3501 205.2409 226.7484 238.6963 249.7476 258.7155 281.1019 298.2366 336.8887 370.9873 394.9995 401.8672 408.8230 421.4996 441.0633 459.5863 499.7205 506.0164 513.5618 566.2004 571.5544 580.5687 613.8900 614.8095 616.4451 649.4367 662.1929 697.8478 703.5068 722.5899 738.0925 757.2023 760.8770 772.6414 797.1573 833.5616 844.5667 857.4820 859.3922 885.5250 910.7338 914.2371 921.2092 952.0251 972.8760 982.9513 986.5454 989.1925 991.9927 992.9695 1010.8345 1013.3858 1029.0132 1036.9295 1052.7993 1067.4961 1081.7739 1085.8719 1100.2093 1123.5913 1130.9478 1173.3004 1173.9044 1186.5521 1190.3167 1198.6496 1199.5913 1205.6174 1215.2998 1237.0975 1289.5366 1316.2766 1320.5637 1342.8849 1350.9009 1367.0013 1386.1010 1387.8266 1409.4493 1434.2937 1438.8381 1446.0543 1460.4240 1461.0654 1476.6362 1485.3039 1487.2681 1488.1088 1496.9092 1521.2971 1590.9292 1591.6034 1603.9996 1606.7009 1609.3272 1620.7889 1629.9949 1650.8162 2971.6345 2976.1022 2989.5762 3045.4947 3051.5671 3091.0402 3105.2611 3112.8668 3129.1044 3131.0626 3133.0951 3141.6756 3143.1546 3154.3333 3160.4997 3167.3516 3175.6045 3188.0287 3352.1840
redmass: 6.0200 3.7744 7.0257 6.1813 5.7432 5.4708 4.6630 5.5559 5.0483 5.2080 4.0908 3.3885 5.9942 4.1697 1.1546 2.9065 5.3218 1.2516 6.2655 4.2612 8.2758 3.8315 5.3495 2.8776 5.9286 7.1532 2.8610 2.9636 5.7524 5.1842 2.8074 3.6131 8.9209 9.3132 5.8895 5.4146 6.0215 6.3089 6.4935 6.1679 5.5267 6.3404 2.1753 2.4373 9.2116 1.3111 2.1288 9.7635 3.4319 5.4710 4.7318 1.2822 1.1512 1.2500 8.0554 1.3165 1.6903 2.3357 7.5245 1.3674 1.3948 4.8801 6.2428 1.5343 1.3869 1.4929 3.3519 2.1731 1.9351 1.4662 2.5506 1.8874 1.5996 1.8435 3.1348 1.9143 1.0518 1.0512 1.2206 1.1695 2.7593 4.3019 1.0891 2.3134 3.8912 3.5020 1.4784 1.5272 3.3905 1.5892 4.1397 8.5035 5.4050 1.2620 1.1941 2.1876 2.1389 1.0838 1.0758 1.1077 1.8764 1.2024 2.3276 1.0750 2.2443 6.4663 6.5030 7.5801 8.0513 6.9000 5.9925 9.7620 8.0981 1.0390 1.0436 1.0569 1.1054 1.0963 1.0902 1.0986 1.0879 1.0869 1.0856 1.1010 1.0891 1.0930 1.0943 1.0982 1.0993 1.0972 1.0966 1.0757
irintensity: 0.0487 0.1260 0.9656 0.2198 5.1052 1.6342 3.3634 1.7811 0.5658 1.3283 1.2091 5.6942 0.4915 2.8948 0.6249 5.1837 10.4645 1.6870 0.2461 3.4054 39.4270 1.9992 10.4061 2.5066 11.4778 0.6570 0.0573 0.3397 36.7038 0.5472 11.7801 11.4263 15.2772 8.7885 1.6464 32.5006 7.5345 3.8397 22.7095 18.6493 12.8689 42.9000 40.9568 23.8370 7.3671 87.9049 48.5029 6.3674 24.0600 8.3076 5.4730 0.1971 85.7315 0.5106 2.9065 1.6137 4.4092 4.6769 84.4558 0.8554 0.0066 0.3323 0.4886 0.6577 0.4670 2.7784 63.7743 9.6072 5.8844 7.0762 3.2198 27.6862 5.7732 10.4738 58.8123 59.7354 0.3763 0.1855 106.0877 76.6208 220.8742 393.2359 8.0161 5.3158 179.8519 124.2082 4.8573 45.6266 89.2522 6.1849 138.6205 3.6362 4.0699 48.2381 11.2586 9.4680 20.9424 16.2643 35.2795 51.1886 120.7941 35.4959 16.3830 18.4587 172.4090 6.8440 45.9751 4.1520 223.5684 261.5953 4.6089 180.6787 39.5036 29.6016 80.7958 8.8956 12.0615 18.1610 13.1625 9.0235 9.2215 1.5868 3.8234 6.9562 9.8715 29.4328 25.2519 30.6756 22.1039 8.0141 1.6374 76.6419
temp: 298.150 k
press: 1.00000 atm
elementType: 8 8 8 8 7 7 7 6 6 6 6 6 6 6 6 6 6 6 6 6 6 6 6 6 6 6 6 1 1 1 1 1 1 1 1 1 1 1 1 1 1 1 1 1 1 1
symmnumber: 1
zpe: 931597.4 jmol-1
zpe.correction: 0.354827 hartree
zpe.thermalcorrener: 0.379616 hartree
zpe.thermalcorrenthalpy: 0.380560 hartree
zpe.thermalcorrgfe: 0.295677 hartree
zpe.sumelectzpe: -1236.746818 hartree
zpe.sumelectthermal: -1236.722029 hartree
zpe.sumelectthermalent: -1236.721084 hartree
zpe.sumelectthermalfe: -1236.805968 hartree
dipole: 2.7418 3.4066 -0.6518
dipole: 4.4212
quadrupole: -114.0451 -150.3897 -157.8807
quadrupole: 18.3181 0.0710 -0.7598
quadrupole: 26.7268 -9.6178 -17.1089 18.3181 0.0710 -0.7598
hfenergy: -1237.1016449 hartree
pointgroup: C01 [X(C20H19N3O4)]
dipole: 1.1579279 -0.271664 1.2692686 debye
polarizability: 434.7275864|8.9936419|164.8572557|-20.6481004|-60.2137142|224.7305902 unknown
InChI: InChI=1S/C20H19N3O4/c1-14-17(19(25)23(22(14)2)16-11-7-4-8-12-16)21-18(24)20(26)27-13-15-9-5-3-6-10-15/h3-12,21H,13H2,1-2H3
charge 0 multiplicity 1
46 atoms
O  2.353632 1.243174 -1.756448
O  -3.437016 -0.107406 -0.230912
O  -1.271971 -0.846579 1.279574
O  -2.033566 0.988396 -1.735551
N  3.431698 -0.402663 1.207712
N  3.711981 0.336698 0.014172
N  0.132251 0.288374 -0.250733
C  2.022394 -0.474828 1.352882
C  1.43716 0.120264 0.236707
C  2.490353 0.65937 -0.637259
C  5.005864 0.300276 -0.592848
C  4.290792 -0.094286 2.37693
C  1.458699 -1.092146 2.600094
C  5.395153 1.374309 -1.432204
C  5.875514 -0.801121 -0.384554
C  6.661674 1.341341 -2.052312
C  7.147055 -0.808688 -0.996437
C  -1.077066 -0.155761 0.236706
C  7.547174 0.260547 -1.830991
C  -2.214512 0.310957 -0.690962
C  -4.61383 0.289795 -1.051016
C  -5.870441 -0.212772 -0.367289
C  -7.116718 0.004217 -1.008395
C  -5.836337 -0.878725 0.880776
C  -8.315544 -0.437422 -0.408502
C  -7.03947 -1.320663 1.479033
C  -8.280641 -1.102405 0.839897
H  4.107002 0.928728 2.760238
H  5.349256 -0.18659 2.091839
H  4.075741 -0.827518 3.168356
H  1.946365 -2.060668 2.815296
H  0.378093 -1.251646 2.470136
H  1.605241 -0.435331 3.479692
H  0.095767 0.815581 -1.142056
H  4.703148 2.201451 -1.606644
H  5.540659 -1.652122 0.217825
H  6.958155 2.167853 -2.707045
H  7.816977 -1.660293 -0.834568
H  8.532008 0.247249 -2.309752
H  -4.489907 -0.140679 -2.062869
H  -4.606778 1.391841 -1.153251
H  -7.153081 0.518381 -1.977716
H  -4.873094 -1.048503 1.369885
H  -9.272668 -0.264448 -0.91309
H  -7.003887 -1.836551 2.445144
H  -9.210378 -1.446388 1.306612
