program: Gaussian 09
title: 000043943
version: EM64L-G09RevD.01
frameworkgroup: C1[X(C13H28)]
method: RPBEPBE
basis: SDD
operation: Freq
keyword: #p
keyword: freq=noraman
keyword: PBEPBE/SDD
title: #p freq=noraman PBEPBE/SDD
converged: YES YES NO NO
title: Mulliken charges:
elementType: C C C C C C C C C C C C C H H H H H H H H H H H H H H H H H H H H H H H H H H H H
charge: 0.042663 -0.035988 -0.440373 -0.451691 -0.381072 -0.373364 -0.358653 -0.753962 -0.352573 -0.351033 -0.721944 -0.699180 -0.699804 0.158221 0.178695 0.189639 0.197783 0.188392 0.192771 0.203769 0.200476 0.185411 0.190294 0.188004 0.186078 0.207822 0.216083 0.212000 0.192645 0.195190 0.192830 0.194774 0.214975 0.207665 0.214376 0.209474 0.209795 0.215039 0.210198 0.209624 0.214950
chargesum: 0.00000
title: Mulliken charges with hydrogens summed into heavy atoms:
elementType: C C C C C C C C C C C C C
charge: 0.200884 0.142707 -0.052952 -0.070528 0.023174 0.002341 0.015428 -0.118057 0.035262 0.036571 -0.084928 -0.064872 -0.065031
polarizability: 1.55412837e+02 -1.88329124e+00 1.47567222e+02 7.53548459e-01 -1.27790326e-01 1.23483434e+02
1716.lowfreq: -7.7324 -0.0005 0.0001 0.0004 3.4653 7.0069 33.2493 36.5757 44.1360
frequency: 33.1438 35.7238 43.9043 46.3552 62.2103 71.1327 93.7895 118.9112 133.2248 155.4690 194.3107 199.7681 216.9586 222.9688 237.1884 254.4138 260.1478 282.6418 295.8948 370.7579 400.3464 406.7388 485.3413 504.2874 583.0573 720.5693 723.7251 744.3939 771.0629 777.7967 801.3764 870.1686 891.3829 893.8638 898.4892 939.8765 955.0069 966.1385 989.7560 998.2575 1033.7240 1035.8801 1045.6008 1063.3473 1073.9108 1077.9598 1090.0295 1093.1231 1126.5441 1154.3572 1166.4933 1180.0644 1204.1871 1216.6435 1236.4643 1251.4934 1264.2077 1272.7582 1277.9918 1282.7552 1287.3301 1289.5009 1302.5313 1316.3222 1324.3748 1338.7780 1346.2937 1349.2690 1353.3003 1363.8275 1379.8499 1387.9945 1388.4273 1389.3963 1456.3185 1462.6347 1465.1250 1466.4195 1468.1832 1471.7886 1476.3661 1476.6068 1477.0902 1478.0968 1481.1898 1485.1770 1487.4450 1487.7880 1488.9238 2928.5588 2951.3707 2951.7648 2954.2434 2956.9731 2959.2947 2965.8901 2966.8468 2969.3678 2970.5449 2970.7282 2971.0566 2973.6152 2989.6468 2991.2836 3007.3296 3010.4587 3018.3107 3031.5584 3033.5429 3060.4319 3065.4663 3066.6282 3067.0268 3068.5770 3069.3386 3070.0593 3074.4740
redmass: 1.9367 2.1971 2.2067 1.8728 2.3753 2.0676 2.7453 2.5136 2.1298 2.4338 2.9055 1.0774 1.3742 1.1477 1.1182 2.6292 2.1582 2.4444 2.4169 2.8812 2.5488 2.4318 2.6744 2.5316 2.7625 1.1859 1.0850 1.5529 1.2181 1.1995 1.4468 1.8622 1.6927 1.6316 1.4576 1.3201 1.3739 1.6456 2.2023 1.7550 1.9414 2.7184 2.3127 1.7610 2.3307 2.1905 1.8820 1.8619 2.3768 2.3360 2.1202 2.1860 1.5064 1.3988 1.2882 1.3096 1.2557 1.1868 1.2397 1.2049 1.0948 1.1236 1.2154 1.2541 1.3944 1.5096 1.5224 1.5531 1.5495 1.4738 1.2208 1.2151 1.2168 1.2030 1.0747 1.0695 1.0715 1.0731 1.0683 1.0473 1.0534 1.0574 1.0672 1.0427 1.0690 1.0622 1.0699 1.0792 1.0565 1.0813 1.0735 1.0595 1.0650 1.0600 1.0603 1.0586 1.0594 1.0455 1.0366 1.0364 1.0470 1.0403 1.0970 1.0966 1.1015 1.1014 1.1005 1.1038 1.1036 1.0988 1.0991 1.1006 1.1006 1.0993 1.0993 1.0992 1.0986
irintensity: 0.0102 0.0037 0.0012 0.0014 0.0062 0.0061 0.0147 0.0184 0.0057 0.1101 0.0397 0.0320 0.0178 0.0029 0.0107 0.0970 0.1524 0.0427 0.0630 0.0255 0.2680 0.2051 0.5245 0.7732 5.2920 6.1376 8.9723 5.9535 2.5665 0.4503 1.3055 1.8350 5.5909 5.0975 4.7546 1.9552 3.6099 2.8732 7.4729 3.2957 2.7323 0.8355 1.6000 2.4657 0.6786 0.5333 10.8429 5.9184 6.6120 0.5957 0.1041 2.4740 0.1937 1.4847 2.8262 2.2078 0.0581 0.8432 1.6454 0.4694 0.3443 0.5119 0.7265 3.4622 1.1586 0.6773 3.4318 2.0206 0.0437 2.2444 13.5150 13.1624 10.7867 16.6870 2.1061 1.5168 0.0784 0.2347 2.8785 11.7158 7.2271 5.2233 1.2809 12.9074 6.9540 1.1357 34.3709 22.9429 1.4921 15.5991 12.3492 1.2644 11.3615 4.8356 5.8939 49.3910 48.4349 112.3729 63.2388 36.9726 63.4022 26.3191 2.2014 2.3223 6.0358 0.9453 17.1566 85.2666 80.5797 26.9690 83.6999 65.8029 71.1320 90.0317 59.8669 55.4095 51.5713
temp: 298.150 k
press: 1.00000 atm
elementType: 6 6 6 6 6 6 6 6 6 6 6 6 6 1 1 1 1 1 1 1 1 1 1 1 1 1 1 1 1 1 1 1 1 1 1 1 1 1 1 1 1
symmnumber: 1
zpe: 998037.4 jmol-1
zpe.correction: 0.380132 hartree
zpe.thermalcorrener: 0.398459 hartree
zpe.thermalcorrenthalpy: 0.399403 hartree
zpe.thermalcorrgfe: 0.332096 hartree
zpe.sumelectzpe: -511.066009 hartree
zpe.sumelectthermal: -511.047682 hartree
zpe.sumelectthermalent: -511.046738 hartree
zpe.sumelectthermalfe: -511.114045 hartree
dipole: -0.0040 -0.0430 -0.0615
dipole: 0.0752
quadrupole: -88.0118 -87.8403 -86.9478
quadrupole: 0.2288 0.2610 0.0335
quadrupole: -0.4118 -0.2403 0.6521 0.2288 0.2610 0.0335
hfenergy: -511.446141 hartree
pointgroup: C01 [X(C13H28)]
dipole: 0.000994 0.0183095 -0.0232158 debye
polarizability: 155.5979559|-1.4483449|147.3131731|-0.480821|1.3992828|123.5523634 unknown
InChI: InChI=1S/C13H28/c1-5-8-10-13(11-9-6-2)12(4)7-3/h12-13H,5-11H2,1-4H3
charge 0 multiplicity 1
41 atoms
C  -0.049682 -0.280715 0.331391
C  0.759104 -1.624431 0.374746
C  -1.477614 -0.456881 -0.262354
C  0.730301 0.85034 -0.399831
C  0.783734 -2.362645 -0.995176
C  -2.474351 0.641569 0.175854
C  1.907286 1.446755 0.407882
C  0.249864 -2.548352 1.50867
C  -3.871075 0.490965 -0.469776
C  2.663863 2.557033 -0.356534
C  1.849556 -3.477364 -1.086088
C  -4.870807 1.57022 -0.00052
C  3.833644 3.157687 0.453077
H  -0.174766 0.042801 1.390031
H  1.811382 -1.359993 0.618041
H  -1.893188 -1.439311 0.041079
H  -1.417185 -0.474847 -1.370601
H  1.110758 0.470589 -1.371207
H  0.03065 1.674155 -0.64952
H  -0.216698 -2.795542 -1.197774
H  0.97373 -1.628527 -1.803899
H  -2.578525 0.615562 1.281275
H  -2.069733 1.64436 -0.07251
H  2.626189 0.647853 0.682955
H  1.521129 1.859167 1.36392
H  -0.798069 -2.859587 1.334935
H  0.860044 -3.465931 1.590953
H  0.289675 -2.031441 2.48606
H  -4.273689 -0.515882 -0.235492
H  -3.768049 0.534347 -1.573464
H  1.950115 3.360815 -0.630897
H  3.046984 2.14378 -1.312146
H  1.860064 -3.936869 -2.091996
H  2.861295 -3.073467 -0.889929
H  1.663732 -4.285389 -0.355151
H  -4.502569 2.584373 -0.246431
H  -5.016415 1.524661 1.095478
H  -5.859877 1.444741 -0.478533
H  3.472479 3.605063 1.398522
H  4.575444 2.379092 0.71416
H  4.358968 3.947345 -0.115301
