program: Gaussian 09
title: 000043935
version: EM64L-G09RevD.01
frameworkgroup: C1[X(C16H16N2O)]
method: RPBEPBE
basis: SDD
operation: Freq
keyword: #p
keyword: freq=noraman
keyword: PBEPBE/SDD
title: #p freq=noraman PBEPBE/SDD
converged: NO YES NO NO
title: Mulliken charges:
elementType: O N N C C C C C C C C C C C C C C C C H H H H H H H H H H H H H H H H
charge: -0.275900 -0.048985 -0.583066 -0.212807 0.596118 -0.423722 -0.544037 -0.716404 0.234151 -0.471751 -0.010569 -0.328320 0.075975 0.306607 -0.355427 -0.367426 -0.228301 -0.227558 -0.235266 0.201436 0.213369 0.208164 0.257822 0.256214 0.219393 0.203021 0.235469 0.252828 0.263140 0.280138 0.262271 0.270781 0.229628 0.231253 0.231762
chargesum: 0.00000
title: Mulliken charges with hydrogens summed into heavy atoms:
elementType: O N N C C C C C C C C C C C C C C C C
charge: -0.275900 -0.048985 -0.039788 -0.011372 0.596118 -0.002189 -0.286215 -0.037776 0.234151 -0.236282 -0.010569 -0.075492 0.075975 0.306607 -0.093157 -0.096645 0.001327 0.003695 -0.003504
polarizability: 3.59062059e+02 -1.79823726e+01 1.83687529e+02 -6.06285921e+00 -5.25657441e+00 9.54066535e+01
1716.lowfreq: -2.5789 -0.0008 -0.0003 0.0005 6.6282 12.3021 31.6868 44.4460 57.7473
frequency: 30.9402 43.6260 57.7347 74.0592 90.1104 108.6811 165.5345 169.8668 190.1753 224.5423 233.9171 259.3972 270.2876 303.5595 326.6677 361.2467 391.4424 403.5365 445.5505 468.4810 492.5915 527.9849 559.3897 578.7102 612.6677 620.0565 650.4241 678.7354 681.8977 698.4834 750.5319 761.0908 782.6819 811.7711 833.8161 845.4944 859.9321 868.5525 880.4798 885.7292 922.4598 942.9281 960.6192 974.2044 988.4230 990.5931 1000.9903 1004.5205 1029.2707 1039.3701 1082.8220 1083.1393 1106.4599 1114.2351 1124.6309 1174.0540 1177.3704 1186.6450 1204.9163 1211.7403 1251.4162 1278.4710 1288.6160 1314.2325 1320.9038 1329.8316 1366.9939 1383.6525 1385.6267 1395.2550 1426.5831 1441.4825 1464.0322 1467.2854 1472.4751 1481.2900 1485.1195 1543.6838 1585.2691 1602.6660 1621.7792 1627.7706 1640.8102 2896.0021 2969.5395 2981.3487 3023.2402 3075.3246 3093.5152 3130.2891 3130.5791 3141.7796 3155.3871 3159.6206 3166.0271 3171.9232 3174.2593 3472.8250 3600.8696
redmass: 4.0190 4.1005 4.4155 4.0268 4.5010 2.7120 1.5063 2.0449 3.9794 1.2815 3.7671 3.2721 3.4713 4.7896 4.7113 4.0551 4.4997 2.8471 3.0086 2.5451 3.8127 6.4080 4.0412 1.5705 5.5983 4.6439 4.0206 5.4706 6.7211 1.7939 4.3893 4.2151 1.9218 5.1589 1.5034 10.9323 1.2474 2.2216 1.6522 1.4263 3.2249 1.4235 1.3583 8.3993 6.2703 1.3811 1.3082 1.3261 2.0403 1.4607 2.8581 1.8031 2.5101 2.5291 1.7324 1.0587 1.7099 1.1549 3.0451 2.3317 1.4846 2.8837 1.3254 1.5481 1.3436 1.4256 1.3708 1.2443 8.0917 2.8952 3.5222 2.5347 1.8817 1.5071 1.7707 1.1927 1.0523 7.2484 6.2892 7.3588 7.0877 7.6964 1.0966 1.0700 1.0833 1.0353 1.0918 1.0988 1.1002 1.0853 1.0892 1.0890 1.0936 1.0925 1.0963 1.0958 1.1002 1.0451 1.0981
irintensity: 0.2165 0.9364 0.1277 0.4098 0.6279 2.0054 33.3520 17.3278 0.8027 1.3970 0.8353 1.9302 4.0774 0.4526 0.7642 14.0220 0.2693 0.0029 4.5297 21.8553 5.2964 4.0883 20.7146 181.3686 6.4476 11.7346 20.2291 12.4539 5.3744 55.5968 8.4088 3.8698 47.0248 37.1095 33.8644 14.2365 0.0258 2.8369 2.6222 22.5355 38.3622 5.3738 0.2339 49.0665 0.1838 0.0099 2.4892 0.4800 4.0661 30.7645 29.5491 10.1527 9.8582 0.9675 6.1838 0.1151 11.7726 8.6370 14.1854 6.1941 7.7542 11.8413 4.3176 5.4379 2.4219 5.5566 5.1930 16.5626 0.7185 11.8654 20.3054 16.7844 25.1905 13.2557 24.3693 13.4718 14.4838 30.7204 0.5118 4.0512 6.8912 21.0252 40.7563 87.8888 21.5795 26.8688 33.0290 44.2221 18.5392 1.0407 16.9195 11.9080 23.0821 6.3588 16.0893 9.1201 17.4315 0.3312 1.9542
temp: 298.150 k
press: 1.00000 atm
elementType: 8 7 7 6 6 6 6 6 6 6 6 6 6 6 6 6 6 6 6 1 1 1 1 1 1 1 1 1 1 1 1 1 1 1 1
symmnumber: 1
zpe: 740713.0 jmol-1
zpe.correction: 0.282123 hartree
zpe.thermalcorrener: 0.298877 hartree
zpe.thermalcorrenthalpy: 0.299821 hartree
zpe.thermalcorrgfe: 0.236851 hartree
zpe.sumelectzpe: -802.678762 hartree
zpe.sumelectthermal: -802.662008 hartree
zpe.sumelectthermalent: -802.661064 hartree
zpe.sumelectthermalfe: -802.724034 hartree
dipole: -1.0755 -0.9511 -1.2389
dipole: 1.8963
quadrupole: -85.9573 -104.3809 -115.6336
quadrupole: -5.1944 7.9138 1.2786
quadrupole: 16.0333 -2.3903 -13.6430 -5.1944 7.9138 1.2786
hfenergy: -802.960885 hartree
pointgroup: C01 [X(C16H16N2O1)]
dipole: 0.4169991 0.3993011 -0.4725366 debye
polarizability: 359.4935651|-16.1365224|182.6870306|4.3511478|9.0684091|95.975645 unknown
InChI: InChI=1S/C16H16N2O/c1-11(10-17)13-7-8-14-15(9-13)19-16(18-14)12-5-3-2-4-6-12/h2-9,11H,10,17H2,1H3
charge 0 multiplicity 1
35 atoms
O  -0.663153 0.748688 0.162294
N  -1.122268 -1.50856 -0.149554
N  6.1904 1.339075 -0.976208
C  4.378151 0.137999 0.274779
C  2.932107 -0.347536 0.171532
C  4.753741 1.01126 -0.965223
C  1.856409 0.578768 0.24604
C  4.666629 0.896633 1.592584
C  0.566791 0.056728 0.123198
C  2.656386 -1.736406 -0.023201
C  0.280772 -1.326148 -0.068344
C  1.345288 -2.246961 -0.143094
C  -1.648684 -0.295513 -0.014234
C  -3.05135 0.106296 -0.021377
C  -3.428071 1.468144 0.13487
C  -4.054373 -0.88852 -0.18901
C  -4.791853 1.825843 0.122171
C  -5.414002 -0.521982 -0.200177
C  -5.788434 0.835231 -0.045084
H  5.034771 -0.756944 0.248305
H  4.406141 0.480059 -1.882889
H  4.187168 1.961142 -0.913934
H  2.028435 1.647841 0.400225
H  5.705465 1.268336 1.575804
H  4.524825 0.2415 2.470885
H  3.994013 1.767303 1.707945
H  3.503464 -2.430391 -0.076214
H  1.154082 -3.313873 -0.287465
H  6.804204 0.548736 -1.193828
H  6.441187 2.181622 -1.498513
H  -2.652533 2.229107 0.264124
H  -3.74627 -1.932212 -0.307755
H  -5.078902 2.87607 0.242919
H  -6.183164 -1.291102 -0.329378
H  -6.847069 1.117468 -0.054194
