program: Gaussian 09
title: 000043922
version: EM64L-G09RevD.01
frameworkgroup: C1[X(C13H15FN2O2)]
method: RPBEPBE
basis: SDD
operation: Freq
keyword: #p
keyword: freq=noraman
keyword: PBEPBE/SDD
title: #p freq=noraman PBEPBE/SDD
converged: YES YES NO NO
title: Mulliken charges:
elementType: F O O N N C C C C C C C C C C C C C H H H H H H H H H H H H H H H
charge: -0.210708 -0.282804 -0.280834 -0.405189 -0.372080 0.377230 0.100701 -0.526994 0.286174 -0.429525 -0.364968 -0.557987 -0.480835 0.171502 0.240898 0.245057 -0.767255 -0.515869 0.212337 0.228788 0.271391 0.261534 0.216780 0.310297 0.279356 0.256634 0.325519 0.253700 0.249688 0.213234 0.235021 0.247547 0.211659
chargesum: 0.00000
title: Mulliken charges with hydrogens summed into heavy atoms:
elementType: F O O N N C C C C C C C C C C C C C
charge: -0.210708 -0.282804 -0.280834 -0.094892 -0.046561 0.377230 0.100701 -0.085870 0.286174 -0.158133 0.113345 -0.278631 -0.224201 0.171502 0.240898 0.245057 -0.050633 0.178358
polarizability: 1.90775344e+02 -1.79101875e+01 2.02177498e+02 -1.84390326e+01 -1.16350308e+01 9.80215714e+01
1716.lowfreq: -9.8537 -7.0373 -2.2279 -0.0008 -0.0007 -0.0004 18.9129 30.4054 37.3561
frequency: 17.9387 30.3768 37.2883 41.2829 72.9012 82.1098 97.8603 119.0588 152.3140 182.2873 188.6453 235.3200 247.3917 288.4024 304.1482 349.2746 358.4997 375.6421 421.2608 425.6900 445.6071 454.0193 481.4627 509.2654 571.7769 582.8087 604.7586 617.5415 626.0035 637.6767 680.6898 704.7331 742.6847 776.7530 790.3328 802.6225 818.8712 832.5829 880.1026 910.6534 944.3518 955.4788 988.2832 1036.0646 1041.5194 1046.6144 1085.0454 1104.1506 1109.1917 1115.4460 1149.2507 1176.5026 1193.5470 1218.1332 1230.7774 1241.0166 1262.7909 1298.6643 1319.1650 1326.8657 1354.7818 1384.5267 1386.0001 1409.8417 1436.5158 1449.3319 1458.0609 1462.8074 1466.0423 1467.2263 1468.5918 1472.2982 1477.2678 1490.9247 1559.5621 1585.1382 1620.8794 1640.6183 2979.0069 2979.9282 2990.2011 2993.4999 3049.1495 3070.2722 3087.5450 3091.2241 3103.4271 3126.4449 3162.6456 3167.2618 3221.0823 3543.1575 3614.9163
redmass: 4.9656 4.5103 2.5875 3.9904 1.4523 2.8742 3.0403 2.5965 5.5101 2.1370 2.7472 3.4550 4.0287 3.9695 3.4686 5.3211 6.1911 5.6019 3.3438 2.9948 2.8748 5.1713 3.3735 1.2540 2.0720 3.3392 3.6581 1.5605 4.7611 3.4216 4.3693 6.6496 3.9617 4.8047 2.2256 1.9081 2.9396 1.5315 1.4311 3.0570 3.6780 3.0621 1.7709 1.8436 2.2979 2.6425 2.1509 3.6142 1.3915 1.6741 1.3733 1.5461 1.8621 1.3209 1.3801 2.7352 1.9654 1.9036 1.5983 2.4739 1.3364 5.5902 1.2635 2.2767 1.7006 1.0567 1.1254 1.1760 1.1624 2.4982 1.1575 2.4780 1.1109 1.8558 6.6442 6.6772 6.1532 7.7130 1.0340 1.0658 1.0604 1.0362 1.1004 1.0984 1.0988 1.0995 1.0990 1.1043 1.0917 1.0930 1.0984 1.0777 1.0810
irintensity: 0.8823 3.3211 1.9861 15.0416 1.3976 4.0384 0.1424 7.2926 2.6914 1.2965 4.0328 3.2049 0.3755 2.0222 4.8484 0.0793 4.2157 4.3098 6.1203 14.5703 1.0503 4.6743 18.0625 86.6458 90.1545 12.7735 1.1045 74.5866 8.1902 2.8276 4.0248 11.6467 5.2920 2.0068 23.8966 18.6838 23.8089 23.9895 31.8442 2.2527 31.4441 43.6139 6.3833 16.4120 25.5431 9.9020 23.2070 10.3955 12.4046 40.8530 3.4112 48.3535 55.4566 14.9576 0.7976 21.5291 109.4426 12.6000 43.9425 93.6272 1.7601 51.6842 68.2998 38.5389 1.8030 16.0263 12.6433 29.9384 67.7868 112.2234 6.4334 8.9859 7.3140 192.0310 17.3742 21.8957 231.6544 1.3832 77.8555 34.8834 35.8967 9.2838 26.1373 7.0818 43.3347 20.4370 13.7719 18.4153 2.7745 1.0543 0.5599 31.9441 72.8583
temp: 298.150 k
press: 1.00000 atm
elementType: 9 8 8 7 7 6 6 6 6 6 6 6 6 6 6 6 6 6 1 1 1 1 1 1 1 1 1 1 1 1 1 1 1
symmnumber: 1
zpe: 682539.4 jmol-1
zpe.correction: 0.259966 hartree
zpe.thermalcorrener: 0.277882 hartree
zpe.thermalcorrenthalpy: 0.278826 hartree
zpe.thermalcorrgfe: 0.211427 hartree
zpe.sumelectzpe: -862.854042 hartree
zpe.sumelectthermal: -862.836126 hartree
zpe.sumelectthermalent: -862.835182 hartree
zpe.sumelectthermalfe: -862.902581 hartree
dipole: 3.1675 3.7150 -3.1509
dipole: 5.8106
quadrupole: -130.7592 -82.0432 -106.6644
quadrupole: -7.5067 -1.5107 0.1492
quadrupole: -24.2703 24.4457 -0.1755 -7.5067 -1.5107 0.1492
hfenergy: -863.1140079 hartree
pointgroup: C01 [X(C13H15F1N2O2)]
dipole: -1.3250038 1.4275867 1.1968586 debye
polarizability: 188.1173247|16.3128813|205.0855456|-20.7474747|5.9529503|97.7715428 unknown
InChI: InChI=1S/C13H15FN2O2/c1-8(17)15-4-3-9-7-16-12-6-11(14)13(18-2)5-10(9)12/h5-7,15-16H,3-4H2,1-2H3
charge 0 multiplicity 1
33 atoms
F  -3.997962 -0.952952 0.53606
O  -1.805802 -2.409372 -0.722791
O  4.664531 -1.355829 -0.115295
N  -1.002917 2.983257 0.545481
N  2.759113 -0.209996 0.585378
C  0.769361 1.907303 -0.436228
C  -0.321515 0.956374 -0.263453
C  2.138167 1.633931 -1.016025
C  -1.416415 1.662424 0.352688
C  0.30927 3.125824 0.066425
C  3.162179 1.083766 0.017881
C  -0.478131 -0.41833 -0.582244
C  -2.645086 1.032486 0.642286
C  -1.695269 -1.072977 -0.303883
C  -2.753691 -0.319137 0.295992
C  3.536837 -1.353901 0.468121
C  2.947518 -2.61284 1.102348
C  -2.501185 -3.370659 0.158214
H  2.560402 2.567345 -1.43531
H  2.063423 0.912984 -1.852022
H  0.817773 4.087663 0.108671
H  4.14248 0.917288 -0.462396
H  3.293841 1.826157 0.83004
H  -1.568317 3.727941 0.945998
H  0.317689 -0.99649 -1.061105
H  -3.498405 1.547277 1.092934
H  1.84801 -0.26977 1.044292
H  2.983081 -3.433479 0.366394
H  3.575745 -2.914267 1.959228
H  1.907405 -2.48555 1.449999
H  -2.263278 -4.357746 -0.266571
H  -3.590805 -3.205506 0.152818
H  -2.119347 -3.304418 1.195075
