program: Gaussian 09
title: 000043989
version: EM64L-G09RevD.01
frameworkgroup: C1[X(C17H28O3Si)]
method: RPBEPBE
basis: SDD
operation: Freq
keyword: #p
keyword: freq=noraman
keyword: PBEPBE/SDD
title: #p freq=noraman PBEPBE/SDD
converged: YES YES NO NO
title: Mulliken charges:
elementType: Si O O O C C C C C C C C C C C C C C C C C H H H H H H H H H H H H H H H H H H H H H H H H H H H H
charge: 1.428982 -0.613934 -0.277060 -0.227044 -0.754744 -0.773202 -0.782309 -0.233020 -0.691232 -0.667668 -0.667356 0.291043 0.244834 0.276328 -0.342201 -0.406910 -0.855033 -0.242670 -0.235646 -0.265924 -0.660363 0.263189 0.219336 0.232972 0.223521 0.220708 0.244893 0.233805 0.225407 0.212805 0.221078 0.216103 0.235351 0.218624 0.215047 0.243348 0.212317 0.271151 0.227508 0.262767 0.225012 0.227246 0.224939 0.224141 0.235452 0.220682 0.216106 0.253440 0.228179
chargesum: 0.00000
title: Mulliken charges with hydrogens summed into heavy atoms:
elementType: Si O O O C C C C C C C C C C C C C C C C C
charge: 1.428982 -0.613934 -0.277060 -0.227044 -0.272219 -0.316709 -0.316707 0.000785 -0.031942 0.002410 0.003357 0.291043 0.244834 0.276328 -0.071051 -0.179402 -0.140008 -0.017731 -0.011505 0.190210 0.037363
polarizability: 2.35316083e+02 2.00914168e+01 2.04293221e+02 -8.68990436e+00 1.28140507e+01 2.03494917e+02
1716.lowfreq: -16.8272 -15.1231 -9.6181 -0.0015 -0.0012 0.0006 6.0276 12.2230 25.4290
frequency: -14.7481 -1.1643 25.1948 39.2601 41.3877 48.9815 51.7251 60.7466 66.5180 83.5259 90.0222 106.9675 117.5469 128.0310 150.6007 153.0140 158.9762 176.4769 190.6465 198.3332 217.3583 222.7394 236.3784 248.5102 262.1610 280.9682 290.3628 319.9288 342.5705 362.2167 403.2357 419.6915 447.8165 455.3955 508.5689 514.3435 555.7816 585.8487 650.3398 652.9195 677.0697 684.2664 700.2611 730.7022 734.7571 747.4920 758.1273 774.1831 781.6946 807.4577 827.8090 846.6085 874.5336 889.8009 955.5452 956.4739 966.4174 983.0045 987.5367 989.9605 990.9232 995.6712 998.5626 1008.3751 1015.3527 1028.4979 1033.4799 1044.2471 1048.4639 1057.8508 1083.2889 1099.2792 1109.0285 1154.2659 1173.0599 1181.4052 1222.9327 1229.8695 1233.0191 1238.8708 1245.6639 1252.9141 1254.4712 1257.2000 1275.3562 1289.3260 1324.3624 1350.4532 1381.3824 1390.2409 1391.5519 1395.5205 1397.2195 1398.6959 1432.4157 1433.5973 1437.5837 1440.7432 1457.4810 1461.9800 1470.4068 1477.8657 1481.9719 1483.2326 1483.7799 1484.7398 1485.5011 1486.3607 1487.2055 1489.9115 1587.5773 1613.0393 1647.2997 2966.0814 2968.8117 2968.9907 2974.3499 2975.0232 2978.7650 2979.3022 2981.3031 2992.9011 3017.9730 3027.4713 3033.2280 3039.2897 3049.9331 3061.5600 3063.5347 3064.6374 3067.4006 3071.4937 3082.1553 3085.1717 3088.1997 3092.1340 3116.8723 3118.2184 3132.0518 3151.4379 3168.4985
redmass: 3.6305 3.8266 3.6303 3.2832 3.7146 2.7653 2.8258 2.4686 2.3685 5.6709 3.1949 3.7420 2.6382 2.3180 1.6526 1.8398 1.3431 2.2095 1.6056 2.1904 1.9061 1.3405 1.3200 2.2234 2.9339 3.2182 2.8572 3.6165 3.9406 5.3022 3.6912 3.2520 3.1409 3.5204 5.4395 3.7490 3.7936 5.0781 2.2130 4.9270 2.2474 3.5340 2.3192 2.3511 1.7597 1.8043 1.6391 2.2909 3.4111 1.4402 3.9107 3.8480 1.5805 2.8474 1.1426 1.4204 1.1760 1.3274 1.5608 1.3599 1.5507 1.4703 1.6615 2.7620 2.4293 2.3510 2.3965 2.1512 1.6453 5.2172 3.4604 2.3168 2.3619 1.6582 1.0685 1.8773 2.8340 1.2669 1.2572 1.2390 1.4043 1.4269 1.5643 1.3987 1.1192 1.3674 1.3290 1.2797 4.0303 1.2310 1.1840 1.1819 1.1932 1.2797 1.8618 1.1372 1.0973 1.0820 1.0879 1.0471 1.0512 2.0554 1.0483 1.0482 1.0519 1.0444 1.0467 1.1857 1.0840 1.0432 6.4832 6.2403 9.4666 1.0574 1.0395 1.0359 1.0379 1.0403 1.0591 1.0762 1.0624 1.0362 1.0983 1.0594 1.0987 1.0977 1.0938 1.0992 1.1000 1.1001 1.0998 1.0997 1.1000 1.0993 1.0975 1.1034 1.0863 1.1056 1.0897 1.0955 1.0978
irintensity: 0.2118 0.9452 0.6647 0.0795 0.2210 0.1926 0.1523 0.2063 0.2344 1.1074 0.3707 1.3730 1.5491 1.3794 0.6629 1.2813 1.6138 1.4247 1.9388 1.1440 0.3018 0.1541 0.5928 1.0260 1.7284 3.7575 4.5063 16.4047 3.9210 4.0867 7.5707 5.2651 8.2638 19.0519 3.4675 1.3527 4.8306 0.6097 6.2118 14.3645 6.9195 20.6325 3.2515 54.8804 50.0022 83.7902 59.0227 114.3199 11.0248 3.5996 15.1289 4.2394 4.6342 14.0060 12.2224 1.0863 10.4931 1.0486 0.5358 0.9505 12.6240 6.0803 7.4336 35.7724 82.8760 15.4266 34.2651 25.1184 10.7627 312.5002 243.5251 32.9820 21.5705 10.4211 1.8115 1.9708 11.2470 1.2521 1.5049 1.1693 2.6189 10.4399 11.6944 16.8737 2.0844 12.1203 4.8232 1.6767 4.6492 22.7860 10.6320 7.1084 8.2508 11.4226 3.8284 8.9572 15.9303 19.8121 16.2088 15.6249 8.2592 12.4234 9.6464 7.2953 13.3299 6.5730 5.1733 21.5846 15.1971 6.2881 0.2530 3.4241 142.6709 19.7103 26.0956 55.3546 19.3612 57.2634 26.4329 15.1571 15.3424 17.2115 14.0521 33.3393 11.1536 1.2330 19.2455 37.9371 46.6819 59.9571 30.2274 52.8598 40.7244 18.7735 36.9884 0.5077 5.1345 30.0498 18.9298 32.7614 14.0554
temp: 298.150 k
press: 1.00000 atm
elementType: 14 8 8 8 6 6 6 6 6 6 6 6 6 6 6 6 6 6 6 6 6 1 1 1 1 1 1 1 1 1 1 1 1 1 1 1 1 1 1 1 1 1 1 1 1 1 1 1 1
symmnumber: 1
zpe: 1081119.6 jmol-1
zpe.correction: 0.411777 hartree
zpe.thermalcorrener: 0.436708 hartree
zpe.thermalcorrenthalpy: 0.437653 hartree
zpe.thermalcorrgfe: 0.355816 hartree
zpe.sumelectzpe: -1178.069651 hartree
zpe.sumelectthermal: -1178.044719 hartree
zpe.sumelectthermalent: -1178.043775 hartree
zpe.sumelectthermalfe: -1178.125611 hartree
dipole: -0.0991 1.4740 2.2477
dipole: 2.6897
quadrupole: -124.0509 -128.8732 -135.1881
quadrupole: -2.8940 -0.3335 4.1458
quadrupole: 5.3198 0.4976 -5.8174 -2.8940 -0.3335 4.1458
hfenergy: -1178.4814279 hartree
pointgroup: C01 [X(C17H28O3Si1)]
dipole: 0.2013508 0.7597195 0.7085863 debye
polarizability: 242.5161873|7.6702466|202.9187742|-10.3540539|14.3348281|197.6692591 unknown
InChI: InChI=1S/C17H28O3Si/c1-6-19-17(18)16(15-13-11-10-12-14(15)5)20-21(7-2,8-3)9-4/h10-13,16H,6-9H2,1-5H3
charge 0 multiplicity 1
49 atoms
Si 2.550789 -0.85935 0.279328
O  0.826038 -0.776747 -0.098055
O  -0.316199 2.647681 0.181199
O  0.443858 1.551425 -1.738409
C  3.4924 0.613867 -0.509477
C  2.730528 -0.837179 2.192497
C  3.042387 -2.533445 -0.491585
C  -0.090606 0.249603 0.334288
C  5.035319 0.454901 -0.442559
C  1.916635 -1.945272 2.910306
C  2.890796 -2.570861 -2.034886
C  -1.527721 -0.269029 0.199288
C  0.059789 1.514825 -0.551927
C  -2.539961 0.058929 1.147994
C  -1.831023 -1.086036 -0.916634
C  -3.845263 -0.45669 0.937633
C  -2.259344 0.922681 2.36762
C  -3.13539 -1.586632 -1.109733
C  -4.149213 -1.26872 -0.177358
C  -0.347999 3.9467 -0.566433
C  -1.684031 4.120162 -1.293129
H  3.156567 0.716118 -1.559127
H  3.192694 1.553422 -0.002144
H  3.806172 -0.931005 2.447179
H  2.421027 0.161204 2.566361
H  4.085962 -2.772357 -0.201898
H  2.404932 -3.315986 -0.035212
H  0.101997 0.562463 1.380443
H  5.545098 1.316727 -0.911915
H  5.39804 0.386919 0.600915
H  5.371666 -0.455741 -0.973296
H  2.001216 -1.861199 4.009933
H  0.844387 -1.889232 2.645955
H  2.269837 -2.953576 2.625405
H  3.145831 -3.56885 -2.437572
H  1.852822 -2.337756 -2.332033
H  3.551942 -1.833043 -2.527232
H  -1.022915 -1.333673 -1.611434
H  -4.63154 -0.217053 1.664008
H  -1.859009 1.9119 2.081445
H  -3.179853 1.077293 2.955909
H  -1.513788 0.450782 3.038062
H  -3.358674 -2.219256 -1.976049
H  -5.167044 -1.651731 -0.314103
H  0.500349 3.960966 -1.273287
H  -0.20022 4.701788 0.222208
H  -1.723255 5.11848 -1.767477
H  -1.803188 3.359226 -2.082417
H  -2.530142 4.037858 -0.589297
