program: Gaussian 09
title: 000005309
version: EM64L-G09RevD.01
frameworkgroup: C1[X(C19H21N3O3S)]
method: RPBEPBE
basis: SDD
operation: Freq
keyword: #p
keyword: freq=noraman
keyword: PBEPBE/SDD
title: #p freq=noraman PBEPBE/SDD
converged: NO YES NO NO
title: Mulliken charges:
elementType: S O O O N N N C C C C C C C C C C C C C C C C C C C H H H H H H H H H H H H H H H H H H H H H
charge: 0.964230 -0.340446 -0.538134 -0.542196 -0.476880 -0.448475 -0.227544 0.170960 0.253529 -0.501116 -0.525932 -0.401861 -0.413495 0.388272 -0.539514 -0.441171 0.172385 0.190585 0.271113 -0.154273 -0.372891 0.076531 -0.354803 -0.222123 -0.620853 -0.622191 0.234079 0.235042 0.219570 0.225526 0.212777 0.212934 0.210478 0.209980 0.394605 0.261852 0.235941 0.282475 0.327487 0.246397 0.282560 0.209601 0.275006 0.247094 0.247247 0.275773 0.209870
chargesum: 0.00000
title: Mulliken charges with hydrogens summed into heavy atoms:
elementType: S O O O N N N C C C C C C C C C C C C C C C C C C C
charge: 0.964230 -0.340446 -0.538134 -0.542196 -0.082275 -0.120988 -0.227544 0.170960 0.253529 -0.031995 -0.080836 0.023850 0.006963 0.388272 -0.277662 -0.205230 0.172385 0.190585 0.271113 -0.154273 -0.090416 0.076531 -0.108406 0.060437 0.110848 0.110698
polarizability: 5.47396843e+02 -4.28244924e+01 2.76826816e+02 2.76484264e-01 4.02362279e+00 1.61352686e+02
1716.lowfreq: -10.0833 -2.9669 0.0011 0.0017 0.0018 5.4685 20.5017 35.9077 43.5385
frequency: 20.4368 35.7636 43.1472 49.3556 59.5285 66.5597 95.3747 102.2202 110.4753 151.5549 158.7608 175.9255 205.4758 210.9780 215.2971 230.5760 233.7087 247.3174 252.7646 269.5618 282.5702 299.4152 307.0648 336.3709 359.6843 362.8523 393.3907 394.8634 416.1016 427.8406 432.4098 447.4727 453.2876 479.6779 489.0522 533.3813 555.5361 588.8000 603.7584 620.6796 647.2880 651.1961 669.3552 673.5003 694.2699 741.5864 768.5720 770.1281 797.5059 807.7707 811.2367 817.9560 830.9503 851.3976 854.6107 862.4667 903.6781 904.9549 925.5025 929.9000 943.6049 951.2190 957.5889 966.7305 998.4388 1000.8775 1016.3818 1041.5783 1077.8716 1078.1332 1088.0703 1108.2456 1116.3566 1132.4523 1140.4898 1156.4359 1170.3900 1171.1232 1183.9237 1202.0575 1205.9241 1234.1513 1237.7427 1243.6505 1261.8098 1290.8873 1305.6926 1322.6359 1332.3860 1339.3488 1342.6658 1365.5078 1377.6567 1404.1989 1405.1230 1414.7491 1416.9598 1439.0750 1452.5342 1452.9035 1458.6043 1462.2760 1464.2450 1465.6373 1469.6155 1474.6649 1477.3462 1495.5633 1527.9153 1549.3730 1576.7898 1594.0888 1617.8775 1653.8975 2913.3534 2916.9546 2961.7989 2964.2430 2981.8554 2986.4741 3016.0832 3021.4473 3025.9829 3036.7196 3038.4030 3047.4572 3055.3348 3094.6344 3096.1658 3108.4031 3146.8661 3147.6363 3166.3485 3199.8314 3593.1394
redmass: 4.8101 3.9884 4.3359 3.8204 4.8011 3.7374 3.5986 5.4942 4.9028 3.6490 6.4871 5.1154 5.2414 3.2753 4.1624 2.6466 1.0681 2.2012 5.7032 2.9222 7.2355 2.9602 1.8991 4.7519 5.9985 4.2398 4.7134 3.3456 4.9210 4.3272 4.9439 4.1753 3.6984 5.9391 2.7276 8.6500 4.7261 1.9521 1.7516 4.0583 3.8249 2.7155 6.4662 5.0549 5.2633 6.3644 4.4360 5.0051 4.6825 13.8966 1.4452 1.4703 1.5235 2.3100 4.4104 4.5660 1.4622 1.4691 2.5239 1.4794 1.4864 6.1655 7.7933 2.1976 3.9172 1.0884 1.4309 2.0939 1.8445 1.2305 1.9484 1.3979 1.6310 1.1480 1.3289 1.7566 3.1673 5.1040 2.9854 2.7024 1.6572 1.4890 1.2970 1.4202 1.6211 1.4009 1.6316 1.8597 2.7591 1.4563 1.4234 2.1479 2.7628 1.1328 2.8076 1.4789 1.8148 3.8102 1.3558 1.1633 2.3035 1.1790 1.0506 1.0435 1.0910 1.0982 1.0576 5.9670 5.1636 4.9579 6.7363 4.6214 7.6942 5.4627 1.0467 1.0461 1.0637 1.0649 1.0643 1.0627 1.1001 1.0943 1.0949 1.0869 1.0854 1.0987 1.1040 1.0982 1.0994 1.0882 1.0892 1.0915 1.0967 1.0979 1.0801
irintensity: 1.6764 0.5578 3.1876 0.8895 0.3236 1.1419 0.7257 1.0268 1.2961 0.1116 2.0742 0.0300 0.6446 0.9908 2.5498 1.9242 0.2666 3.7885 1.6258 5.3901 1.2942 2.8210 0.6833 12.1995 4.1640 0.7106 4.6634 3.6777 16.5879 48.2581 73.8834 3.2913 5.5549 89.9763 1.9879 14.8941 16.5078 116.1740 27.0461 30.0655 5.0979 3.3341 18.5590 2.8546 1.0725 6.7814 6.0304 4.8695 3.2245 113.6831 23.4596 30.6214 11.7608 4.6635 36.1190 3.4196 7.5281 2.4166 9.7093 17.1390 6.8036 48.7058 9.9787 6.9184 36.1137 91.6342 0.5377 50.5516 4.4437 0.0286 24.9786 36.3444 33.6385 1.3593 145.2160 1.6083 1.4372 8.5584 392.2846 11.9066 17.5653 14.0049 11.6547 10.2331 5.5598 49.5849 30.7836 283.3600 2.4772 10.3276 2.4249 160.6722 194.9766 24.7341 71.4673 19.4345 15.9909 1.4932 27.0565 12.1550 64.9105 25.4763 3.2568 9.6692 14.1073 1.5373 53.3984 37.0827 146.9983 175.5455 56.6994 314.9907 22.9593 664.9302 23.9253 89.5628 21.8488 49.4536 44.6389 31.9069 294.3694 42.6927 28.0187 2.7892 56.7321 96.3956 56.7484 2.0286 2.9218 3.8714 11.1633 5.0091 9.1616 2.4382 70.0646
temp: 298.150 k
press: 1.00000 atm
elementType: 16 8 8 8 7 7 7 6 6 6 6 6 6 6 6 6 6 6 6 6 6 6 6 6 6 6 1 1 1 1 1 1 1 1 1 1 1 1 1 1 1 1 1 1 1 1 1
symmnumber: 1
zpe: 967703.6 jmol-1
zpe.correction: 0.368579 hartree
zpe.thermalcorrener: 0.392833 hartree
zpe.thermalcorrenthalpy: 0.393778 hartree
zpe.thermalcorrgfe: 0.314053 hartree
zpe.sumelectzpe: -1522.591219 hartree
zpe.sumelectthermal: -1522.566965 hartree
zpe.sumelectthermalent: -1522.566021 hartree
zpe.sumelectthermalfe: -1522.645745 hartree
dipole: 6.6530 2.4604 4.9479
dipole: 8.6486
quadrupole: -163.2132 -150.7478 -165.8296
quadrupole: -22.3002 -26.1018 -6.2121
quadrupole: -3.2830 9.1824 -5.8993 -22.3002 -26.1018 -6.2121
hfenergy: -1522.9597984 hartree
pointgroup: C01 [X(C19H21N3O3S1)]
dipole: 2.5646294 -0.1601462 2.2304312 debye
polarizability: 548.4848899|-37.1922953|242.6254228|-13.3354192|51.8144603|194.4660325 unknown
InChI: InChI=1S/C19H21N3O3S/c1-22(2)26(24,25)14-7-8-18-15(11-14)16(19(23)21-18)10-13-9-12-5-3-4-6-17(12)20-13/h7-11,20-21H,3-6H2,1-2H3
charge 0 multiplicity 1
47 atoms
S  -4.870547 -0.493446 -1.098341
O  1.819169 2.200082 1.771336
O  -6.165868 0.471367 -1.285348
O  -4.122218 -1.243188 -2.333245
N  3.345964 0.432086 0.522712
N  -0.521654 2.524321 1.773837
N  -5.481042 -1.908977 0.030706
C  4.617549 -0.029135 0.295702
C  4.552798 -1.141409 -0.599751
C  5.878275 0.552493 0.871206
C  5.793611 -1.886664 -1.038118
C  7.049391 -0.450802 0.681994
C  7.066902 -1.044951 -0.749826
C  2.424794 -0.350387 -0.205213
C  3.187931 -1.339305 -0.910718
C  1.018869 -0.166881 -0.211012
C  0.217807 0.768376 0.455283
C  -1.243557 0.857488 0.371933
C  -1.669216 1.955107 1.196358
C  -3.556847 0.495533 -0.168313
C  -2.212185 0.110534 -0.328941
C  0.650822 1.854108 1.368359
C  -3.018066 2.331037 1.329473
C  -3.987801 1.578029 0.625176
C  -4.380116 -2.861911 0.300895
C  -6.149773 -1.355954 1.230767
H  6.119981 1.505028 0.354764
H  5.747304 0.804715 1.941484
H  5.86468 -2.851833 -0.495023
H  5.739179 -2.140511 -2.113902
H  8.006394 0.061207 0.893694
H  6.951468 -1.274229 1.416833
H  7.966055 -1.674984 -0.884625
H  7.137795 -0.217424 -1.48412
H  3.010254 1.22908 1.122147
H  2.765564 -2.099099 -1.5691
H  0.486583 -0.885291 -0.850314
H  -1.955812 -0.714369 -1.002126
H  -0.497629 3.325638 2.403332
H  -3.319635 3.183242 1.94656
H  -5.049113 1.843459 0.65812
H  -3.636708 -2.499439 1.047305
H  -3.874692 -3.097632 -0.650442
H  -4.838051 -3.792445 0.683544
H  -6.739863 -2.173876 1.683286
H  -6.850567 -0.565418 0.914452
H  -5.449078 -0.957371 1.999525
