program: Gaussian 09
title: 000043929
version: EM64L-G09RevD.01
frameworkgroup: C1[X(C16H20N2O2)]
method: RPBEPBE
basis: SDD
operation: Freq
keyword: #p
keyword: freq=noraman
keyword: PBEPBE/SDD
title: #p freq=noraman PBEPBE/SDD
converged: YES YES NO NO
title: Mulliken charges:
elementType: O O N N C C C C C C C C C C C C C C C C H H H H H H H H H H H H H H H H H H H H
charge: -0.265752 -0.270310 -0.147319 -0.055658 0.454117 -0.399633 -0.397746 -0.385415 -0.384100 -0.656854 -0.658067 0.507856 -0.352680 -0.444070 -0.343738 0.091133 0.188510 -0.226242 -0.216450 -0.671246 0.232746 0.226333 0.229672 0.227415 0.235220 0.232745 0.217944 0.243009 0.221771 0.219870 0.241032 0.220683 0.258370 0.233121 0.264710 0.227013 0.227571 0.206789 0.233640 0.234011
chargesum: 0.00000
title: Mulliken charges with hydrogens summed into heavy atoms:
elementType: O O N N C C C C C C C C C C C C C C C C
charge: -0.265752 -0.270310 -0.147319 -0.055658 0.454117 0.059446 0.059340 -0.150195 -0.151354 0.025870 0.023518 0.507856 -0.094310 -0.210950 -0.079028 0.091133 0.188510 0.228342 -0.216450 0.003195
polarizability: 4.48648120e+02 -6.10255979e+00 1.95976968e+02 -8.53645287e-01 1.00832005e+01 1.09635246e+02
1716.lowfreq: -10.0139 -3.7907 -1.5747 -0.0005 0.0003 0.0009 24.0014 30.7451 41.1451
frequency: 23.9156 30.6508 41.1395 52.0585 65.3776 68.7886 89.2934 98.2177 108.1435 118.8207 123.3254 161.7740 186.0177 188.7074 211.6868 214.5013 243.9743 257.5033 287.4905 309.5282 321.0812 351.7341 375.7615 407.2981 413.7112 435.6752 436.5715 508.9954 512.9563 532.1141 548.7960 589.7283 626.4811 674.8491 722.8757 738.5651 745.6961 778.8019 787.4209 789.4300 798.6216 805.9936 809.6410 828.3886 881.8530 894.4345 924.9906 950.0760 974.4658 989.4261 990.9454 1013.9487 1022.6970 1066.5563 1073.6621 1076.4749 1094.5741 1113.1631 1135.5494 1140.0321 1162.8772 1189.6913 1199.6742 1223.6174 1248.0873 1269.4280 1276.1350 1285.6191 1330.6541 1339.9974 1347.7731 1355.1854 1361.8265 1387.5331 1389.2529 1392.1662 1402.3023 1411.7621 1460.5928 1462.4387 1467.4193 1469.2382 1473.1935 1478.4064 1482.8071 1486.2320 1494.3730 1505.8737 1526.2371 1538.0974 1572.7137 1613.6079 1632.4314 2154.0525 2986.4585 2986.8204 2996.6108 2998.3445 3003.5848 3007.0533 3047.2518 3052.5806 3065.6658 3083.5365 3083.6775 3093.0927 3094.2547 3094.2821 3095.9206 3109.6132 3123.4537 3157.9745 3166.8630 3180.9374
redmass: 3.8825 4.8400 3.1772 4.1952 3.0054 3.2814 3.4301 4.6517 3.2737 2.9678 5.8985 3.3055 3.7265 4.8470 1.2085 1.1631 1.3517 3.0115 5.0968 3.0437 3.6452 3.6664 3.7962 3.0481 4.6578 4.1806 3.2974 2.7079 4.5422 4.8369 3.1063 5.2985 7.1575 4.3357 7.4724 6.8861 3.7698 2.6309 1.2496 1.6351 1.1054 1.6536 2.0117 1.7036 4.5002 2.3498 2.1434 1.3306 1.3528 1.4525 2.9537 2.9032 2.3657 6.1351 2.2111 1.8344 1.6977 2.2381 1.4663 1.7867 1.8951 2.2685 2.0375 1.3017 1.1343 1.4167 2.2109 1.2016 1.4660 1.3248 1.3384 1.7235 2.0480 1.7556 1.2125 1.3472 1.2712 2.1295 3.3536 1.0396 1.0696 1.0435 1.0622 1.0968 1.0495 1.0679 1.1010 1.3333 2.3110 4.8610 7.7356 8.7809 6.2714 12.6138 1.0356 1.0357 1.0362 1.0606 1.0611 1.0578 1.1028 1.1023 1.1069 1.1000 1.0996 1.0984 1.0887 1.1002 1.1011 1.1022 1.0893 1.0873 1.0932 1.0956
irintensity: 1.6045 1.2916 0.1964 1.1519 0.5846 0.7998 1.2663 1.6331 0.5404 2.6509 1.0556 2.5493 2.5789 0.3379 1.1663 0.1384 0.2589 6.6227 3.5775 0.0974 6.3107 7.3774 1.1438 3.7911 4.0884 7.3038 3.9263 19.5082 5.6875 23.1950 0.9188 2.4062 0.8018 10.0634 13.1057 1.0665 0.7332 13.2668 2.4758 10.6799 3.8071 2.2605 2.3898 64.7876 27.5011 3.3615 2.4652 1.3006 0.4440 12.7030 2.5311 56.7873 30.2800 494.8580 12.4464 31.7175 17.5590 16.0626 5.7745 83.5978 74.5867 860.1563 113.4538 17.7321 0.0185 142.4923 30.8713 1.6872 10.7679 18.0217 136.1502 3.0157 5.2445 41.2323 0.8278 36.0564 21.6692 102.1500 45.7385 11.7427 3.3776 14.3248 8.5846 3.0761 0.3030 12.3016 37.0327 142.7669 402.9687 40.3162 787.9187 172.6649 384.0374 56.5297 30.1688 28.0955 26.4142 47.1088 66.8256 27.2212 4.4786 7.1248 11.7353 10.4530 73.6098 35.7917 0.8164 10.7317 76.9438 40.8729 6.7268 8.6994 22.7471 12.0104
temp: 298.150 k
press: 1.00000 atm
elementType: 8 8 7 7 6 6 6 6 6 6 6 6 6 6 6 6 6 6 6 6 1 1 1 1 1 1 1 1 1 1 1 1 1 1 1 1 1 1 1 1
symmnumber: 1
zpe: 858824.4 jmol-1
zpe.correction: 0.327109 hartree
zpe.thermalcorrener: 0.348464 hartree
zpe.thermalcorrenthalpy: 0.349408 hartree
zpe.thermalcorrgfe: 0.274862 hartree
zpe.sumelectzpe: -880.150471 hartree
zpe.sumelectthermal: -880.129116 hartree
zpe.sumelectthermalent: -880.128172 hartree
zpe.sumelectthermalfe: -880.202717 hartree
dipole: 7.5366 -1.6600 -0.2804
dipole: 7.7223
quadrupole: -75.8031 -126.6958 -122.0520
quadrupole: 3.5380 0.4727 -1.0853
quadrupole: 32.3805 -18.5121 -13.8684 3.5380 0.4727 -1.0853
hfenergy: -880.4775796 hartree
pointgroup: C01 [X(C16H20N2O2)]
dipole: 2.9433816 -0.2087767 -0.7235855 debye
polarizability: 447.9534833|-8.441162|114.9435818|-12.1345589|23.0219931|191.3632692 unknown
InChI: InChI=1S/C16H20N2O2/c1-4-18(5-2)15-9-7-13(8-10-15)11-14(12-17)16(19)20-6-3/h7-11H,4-6H2,1-3H3
charge 0 multiplicity 1
40 atoms
O  -4.861323 0.088469 0.352929
O  -4.048644 -0.363298 -1.790133
N  4.292352 -0.118559 0.02454
N  -2.361766 0.542203 2.63369
C  2.91235 -0.130834 -0.144997
C  4.915756 0.053052 1.356693
C  5.220788 -0.277824 -1.117065
C  2.018949 0.124655 0.953822
C  2.313286 -0.398879 -1.424161
C  5.11305 1.533672 1.756509
C  5.533633 -1.75454 -1.45261
C  0.0308 -0.156481 -0.484315
C  0.632253 0.108465 0.789194
C  0.924689 -0.405222 -1.575653
C  -1.388343 -0.1921 -0.757223
C  -2.496686 -0.000722 0.063418
C  -3.839191 -0.114451 -0.573478
C  -6.254031 -0.004359 -0.17823
C  -2.430385 0.294267 1.462876
C  -7.188398 0.221353 1.005597
H  4.312565 -0.474653 2.117034
H  5.896199 -0.458042 1.33344
H  4.809864 0.241187 -2.001719
H  6.158346 0.249041 -0.859556
H  2.417971 0.352709 1.945737
H  2.937571 -0.61678 -2.294665
H  5.755285 2.057424 1.025588
H  4.147813 2.066614 1.801976
H  5.595592 1.60312 2.748662
H  5.986984 -2.267018 -0.585044
H  4.617509 -2.304551 -1.728817
H  6.244417 -1.815719 -2.297126
H  0.002755 0.31199 1.659348
H  0.500723 -0.616824 -2.565332
H  -1.665393 -0.408041 -1.800612
H  -6.375783 0.759296 -0.96817
H  -6.38427 -0.999838 -0.640684
H  -8.239715 0.166291 0.66831
H  -7.029802 -0.544922 1.783252
H  -7.017569 1.213048 1.457779
