program: Gaussian 09
title: 000005317
version: EM64L-G09RevD.01
frameworkgroup: C1[X(C16H18N2O7S2)]
method: RPBEPBE
basis: SDD
operation: Freq
keyword: #p
keyword: freq=noraman
keyword: PBEPBE/SDD
title: #p freq=noraman PBEPBE/SDD
converged: YES YES NO NO
title: Mulliken charges:
elementType: S S O O O O O O O N N C C C C C C C C C C C C C C C C H H H H H H H H H H H H H H H H H H
charge: 0.218322 0.990817 -0.170137 -0.415139 -0.194004 -0.240478 -0.576900 -0.512299 -0.532205 -0.121558 -0.363558 -0.451705 -0.160638 -0.075207 -0.173891 0.108648 -0.656738 -0.689575 0.159560 0.278379 -0.653154 0.533968 -0.367730 -0.313627 -0.221871 -0.231379 -0.216480 0.322581 0.291713 0.305943 0.241182 0.221813 0.255191 0.229819 0.240158 0.244204 0.356367 0.335766 0.387162 0.238194 0.279055 0.381782 0.239486 0.238595 0.239567
chargesum: 0.00000
title: Mulliken charges with hydrogens summed into heavy atoms:
elementType: S S O O O O O O O N N C C C C C C C C C C C C C C C C
charge: 0.218322 0.990817 -0.170137 -0.027977 -0.194004 -0.240478 -0.195118 -0.512299 -0.532205 -0.121558 -0.007191 -0.129124 -0.160638 0.216506 0.132051 0.108648 0.061448 0.024605 0.159560 0.278379 -0.317388 0.533968 -0.129536 -0.034572 0.017615 0.007216 0.023087
polarizability: 3.85936062e+02 -3.07783729e+01 2.40372707e+02 8.49940785e+00 9.03323558e+00 1.99548340e+02
1716.lowfreq: -5.0861 -3.1249 -0.0027 -0.0021 -0.0009 3.2747 11.4110 15.4991 24.7322
frequency: 10.1928 15.3883 24.5460 30.1266 42.8620 46.8125 54.2466 59.5220 62.5729 80.0804 100.8035 102.9500 126.1584 131.2085 146.3166 157.1916 175.0234 189.9193 197.4315 212.0579 227.2566 237.8427 253.8872 259.6319 277.8925 282.9537 289.2874 295.7767 300.2479 337.7235 358.0641 368.1856 383.5916 395.4185 400.6165 411.6358 440.9616 472.2203 505.5323 516.0274 535.5165 548.1714 569.9684 599.1944 609.3212 622.0790 637.7736 684.9572 687.7386 706.7724 717.7212 744.0471 767.1998 782.2452 793.9860 817.7546 829.7490 832.2162 846.4369 848.8270 903.6424 923.2438 935.3157 940.5216 945.0988 949.1608 981.4588 983.6902 989.0675 992.6969 1006.1006 1006.8057 1026.4538 1037.1642 1038.2445 1066.6042 1076.4907 1093.5342 1115.1342 1125.6967 1152.2061 1178.3686 1183.8510 1191.6388 1196.3690 1199.4657 1205.2898 1214.1154 1247.2235 1248.7061 1279.7480 1290.1124 1320.0586 1327.1599 1356.4034 1360.6649 1385.5184 1395.2566 1403.2394 1445.4548 1457.5478 1461.5749 1475.5945 1478.9003 1484.0417 1548.9588 1576.5833 1599.3038 1606.8971 1681.0798 1733.1281 2980.3369 2987.6368 3024.1471 3055.9989 3066.9120 3075.1719 3085.5345 3088.5945 3095.2360 3106.2564 3130.9948 3139.3150 3155.8309 3170.3916 3192.9117 3293.8400 3483.0593 3514.3542
redmass: 7.4419 7.2433 7.5566 6.5208 5.1685 5.2763 8.3916 6.3746 10.2513 9.7194 7.6899 7.4621 6.9860 7.6869 5.4009 2.8963 6.2875 2.8753 4.2775 2.5222 2.8279 1.3640 2.9359 5.7128 1.7370 2.8112 4.8617 5.3641 6.0404 4.3566 4.7277 4.9283 4.2860 2.9183 6.9103 7.8388 5.9498 4.4512 5.4964 3.9365 6.7827 4.9034 4.3654 3.6632 5.8273 1.7088 5.5655 1.6626 3.3477 5.8124 6.9585 5.5879 3.1250 1.9209 1.7350 8.1458 5.2356 4.7521 1.2997 4.0985 5.1794 5.4001 1.7484 2.2081 1.6847 2.9754 4.3958 1.4176 5.6917 4.3887 1.3493 1.3470 2.1616 1.2932 2.7806 2.5098 1.2157 1.5573 2.0737 1.7883 1.6341 1.0853 1.8749 1.3786 1.7098 1.4872 1.3832 1.6859 2.9350 1.7455 1.6401 4.4398 1.7846 1.6439 1.8696 1.4932 1.1955 7.2476 1.1939 2.2552 1.0502 1.0460 1.0499 1.0495 2.3328 1.9597 5.4494 3.3816 5.8156 9.0621 12.6857 1.0387 1.0357 1.0843 1.0872 1.0846 1.0959 1.0992 1.0901 1.1007 1.1005 1.0879 1.0888 1.0933 1.0994 1.0963 1.0836 1.0664 1.0642
irintensity: 0.7242 0.7149 0.8593 1.5333 0.0591 0.7819 0.1500 0.8904 4.2077 3.1637 0.4401 15.7410 1.2177 24.0114 16.5667 7.6291 8.4596 56.2232 8.5170 10.4752 1.8704 4.1365 4.3901 3.5027 1.2359 4.6734 5.0493 3.9673 30.1810 2.0718 3.0894 17.7960 31.0112 3.6273 42.6044 5.5980 24.8635 12.6395 97.3038 45.8480 22.4297 12.3723 10.1326 54.3323 13.4141 66.4117 20.6199 46.8299 34.8440 8.0579 7.4270 14.9792 26.3542 50.7961 101.4181 47.2397 14.4306 9.8664 4.7444 11.9603 31.9501 64.9287 0.8428 3.4274 1.5811 1.8947 17.5324 0.2240 6.5010 14.1039 1.2003 2.8903 2.3891 53.1678 217.7873 161.2914 35.4996 11.0852 7.4543 52.8834 15.6370 1.0472 7.3954 9.1352 58.6976 3.7354 12.2562 11.1314 204.2189 14.8751 16.5568 151.0815 30.2851 22.0873 34.3563 24.3188 27.3025 8.5849 17.5163 18.9056 0.1519 6.9023 15.1904 7.2680 2.6052 380.4325 1.3128 61.9051 73.7423 184.6054 415.3626 19.3850 20.1659 6.1257 2.3014 28.0917 14.0795 12.5793 13.0043 14.9391 18.0574 1.6133 2.4013 17.8169 27.0368 3.6501 161.8832 48.2463 37.0493
temp: 298.150 k
press: 1.00000 atm
elementType: 16 16 8 8 8 8 8 8 8 7 7 6 6 6 6 6 6 6 6 6 6 6 6 6 6 6 6 1 1 1 1 1 1 1 1 1 1 1 1 1 1 1 1 1 1
symmnumber: 1
zpe: 853110.6 jmol-1
zpe.correction: 0.324933 hartree
zpe.thermalcorrener: 0.353437 hartree
zpe.thermalcorrenthalpy: 0.354381 hartree
zpe.thermalcorrgfe: 0.261511 hartree
zpe.sumelectzpe: -2050.524991 hartree
zpe.sumelectthermal: -2050.496486 hartree
zpe.sumelectthermalent: -2050.495542 hartree
zpe.sumelectthermalfe: -2050.588413 hartree
dipole: 0.2615 -2.3304 -2.6982
dipole: 3.5748
quadrupole: -112.8008 -190.9707 -175.2947
quadrupole: -7.1210 9.8824 6.4486
quadrupole: 46.8880 -31.2820 -15.6060 -7.1210 9.8824 6.4486
hfenergy: -2050.8499232 hartree
pointgroup: C01 [X(C16H18N2O7S2)]
dipole: 0.1804678 -0.7239496 1.1922201 debye
polarizability: 383.8218156|30.2465013|201.3494259|23.0782263|5.5741545|240.685868 unknown
InChI: InChI=1S/C16H17N2O4S.HO3S/c1-16(2)12(15(21)22)18-13(20)11(14(18)23-16)17-10(19)8-9-6-4-3-5-7-9;1-4(2)3/h3-8,11-12,14,17,21H,1-2H3;1H
charge 0 multiplicity 1
45 atoms
S  -2.887924 -0.435678 2.120743
S  2.409402 -0.982447 -1.674129
O  -2.56156 2.679943 -1.153598
O  -6.598635 -0.057319 -1.160709
O  -4.7793 -1.030304 -2.239238
O  1.425971 1.548363 1.411169
O  2.088385 -2.05358 -0.171615
O  3.754665 -1.524301 -2.392615
O  1.035047 -0.92376 -2.558582
N  -3.044951 0.417533 -0.404818
N  0.176569 0.835324 -0.428035
C  -2.021815 -0.247262 0.442559
C  -4.574928 -0.701531 1.177756
C  -4.464197 0.23459 -0.11188
C  -1.094149 1.01148 0.23721
C  -2.294372 1.604309 -0.593802
C  -4.693793 -2.197973 0.815835
C  -5.7200 -0.241849 2.096746
C  -5.233958 -0.360922 -1.295143
C  1.363087 1.101845 0.225419
C  2.636284 0.929148 -0.610083
C  3.95761 0.8967 0.024732
C  5.083961 1.343174 -0.728856
C  4.156806 0.385489 1.342506
C  6.375915 1.307269 -0.172365
C  5.451003 0.35085 1.891691
C  6.561255 0.811735 1.140645
H  -1.63707 -1.210338 0.078238
H  -4.919658 1.216148 0.117312
H  -0.931151 1.572159 1.17288
H  -4.629446 -2.805911 1.733227
H  -5.668755 -2.407313 0.334513
H  -3.89489 -2.523843 0.127737
H  -5.788521 -0.889878 2.988076
H  -5.572282 0.798901 2.43338
H  -6.680559 -0.301336 1.552838
H  0.196897 0.379969 -1.358783
H  2.592707 1.509122 -1.549046
H  -7.101638 -0.443934 -1.928145
H  4.938611 1.721524 -1.74776
H  3.29811 0.039145 1.921725
H  2.447548 -2.964127 -0.38173
H  7.234106 1.656988 -0.754861
H  5.60131 -0.034822 2.90532
H  7.566204 0.780823 1.576137
