program: Gaussian 09
title: 000043836
version: EM64L-G09RevD.01
frameworkgroup: C1[X(C18H20O3)]
method: RPBEPBE
basis: SDD
operation: Freq
keyword: #pfreq=noraman
keyword: PBEPBE/SDD
title: #p freq=noraman PBEPBE/SDD
converged: YES YES NO NO
title: Mulliken charges:
elementType: O O O C C C C C C C C C C C C C C C C C C H H H H H H H H H H H H H H H H H H H H
charge: -0.281098 -0.405333 -0.240654 -0.093893 -0.276531 0.381499 0.404924 0.498415 -0.692417 -0.697777 -0.589494 -0.522416 -0.638517 0.315270 -0.628022 -0.389026 -0.387217 0.207652 -0.240582 -0.239682 -0.240832 0.218162 0.216838 0.196589 0.211929 0.197487 0.244841 0.222166 0.215647 0.205750 0.264955 0.285852 0.246442 0.244227 0.247016 0.240058 0.241137 0.225139 0.225584 0.229157 0.376756
chargesum: 0.00000
title: Mulliken charges with hydrogens summed into heavy atoms:
elementType: O O O C C C C C C C C C C C C C C C C C C
charge: -0.281098 -0.028577 -0.240654 0.124269 0.136895 0.381499 0.404924 0.498415 -0.038160 -0.054215 -0.324538 -0.236564 -0.392075 0.315270 -0.136779 -0.148968 -0.146080 0.207652 -0.015443 -0.014098 -0.011675
polarizability: 2.99650985e+02 -1.36766644e+01 2.24409492e+02 -6.78397968e+00 -4.59862516e+00 1.19182915e+02
1716.lowfreq: -8.0331 -1.8969 -0.0009 -0.0002 0.0007 4.7209 19.6839 28.5655 32.3501
frequency: 19.5702 28.5491 32.3275 40.5238 49.9348 57.0463 75.1601 101.6755 113.3981 142.3537 191.2184 192.1539 217.2974 220.7433 230.0373 239.1449 250.1190 299.1955 327.6587 374.5792 388.6730 402.4660 406.6527 430.3012 459.7497 489.2395 536.7157 545.5636 566.1731 592.6808 609.2851 618.9527 636.2175 658.4500 700.2413 703.5802 734.4522 771.3004 831.2860 832.6697 845.4580 851.7123 877.4275 890.8384 893.2317 914.7279 921.4069 922.8354 937.5174 940.8914 961.3526 970.9287 974.0315 981.3087 990.3591 994.0389 1012.8831 1029.4349 1061.2761 1081.4826 1084.5457 1137.1518 1149.3712 1163.5689 1173.3115 1182.3165 1191.1945 1193.9829 1209.0546 1239.2565 1267.7634 1288.1262 1296.1489 1314.6560 1321.4057 1330.5693 1345.8940 1371.8826 1373.9810 1377.7207 1387.0805 1397.3166 1426.1920 1447.3471 1452.2142 1459.1750 1464.7005 1468.2094 1478.9199 1481.0361 1489.2123 1495.1260 1581.5138 1595.9024 1612.9072 1615.1022 1658.6305 2944.0461 2971.8644 2975.4620 2990.5202 3014.4484 3014.6075 3062.5380 3070.2872 3078.3561 3093.8195 3104.4038 3122.6819 3127.8404 3138.8474 3141.9518 3149.2292 3159.1184 3163.7250 3165.0300 3504.0799
redmass: 5.9037 5.5645 4.9143 2.8207 4.1919 4.3145 4.8406 4.6090 4.4722 2.7427 1.4776 1.5491 4.4897 4.9653 1.3296 3.6283 4.0860 3.9395 3.9186 3.5951 2.5565 2.8465 2.8424 2.2283 3.4046 3.4970 4.1087 3.7566 3.5180 6.7263 4.5525 5.1429 2.8114 2.0734 1.8959 1.9846 4.2078 1.8808 2.6242 3.5772 3.0688 1.2783 1.4212 2.5103 1.4995 1.7759 1.4499 1.2519 1.7949 1.9567 2.0815 1.7917 1.5008 4.9496 5.0412 1.3220 4.9416 2.3618 1.9458 1.9249 1.6012 1.9689 1.7542 1.6926 1.0569 1.2097 1.7764 1.1630 1.9014 1.2743 1.3783 1.3240 1.3671 1.5606 2.9234 2.0457 1.4731 2.2853 2.2443 1.2869 4.6568 1.2496 2.8819 1.5142 2.0426 1.8780 1.0998 1.0462 1.1042 1.0517 1.0669 2.7490 5.3598 6.0932 6.1675 6.6251 8.4762 1.0555 1.0360 1.0383 1.0850 1.0666 1.1008 1.0991 1.0989 1.0989 1.0991 1.0987 1.0844 1.0873 1.0916 1.0917 1.0962 1.0915 1.0915 1.1014 1.0638
irintensity: 0.5920 2.0037 1.0907 0.2825 0.5654 0.3372 0.2832 0.5688 0.7020 1.7787 0.6238 0.5247 0.7398 0.4526 0.3260 0.4511 1.0243 0.8008 0.1973 1.0496 1.8192 1.7070 0.0518 3.3993 3.0130 11.3864 16.4348 10.7541 36.0908 5.0991 1.8388 2.1865 66.3051 102.0282 3.6176 60.1908 14.0087 67.1758 6.0646 11.1075 36.5874 1.1794 0.2749 12.8268 16.1922 7.1256 3.1160 5.9364 15.6479 24.0668 12.8878 13.0779 1.9138 2.5617 0.9799 0.6475 114.6343 6.3788 217.2749 46.9931 4.8813 3.2048 0.5012 119.7684 1.2111 40.1727 1.2461 1.3223 61.5038 2.7328 0.3081 12.1799 8.8254 5.2906 85.7683 74.8358 1.9462 1.3633 10.7375 22.8849 33.3338 35.3057 21.1046 24.1102 69.3987 8.9085 3.9679 1.5902 5.4069 14.6491 24.2512 13.4249 53.1851 78.6780 33.2902 107.4186 200.4942 29.4290 33.7272 33.6228 6.8219 9.4770 41.8116 15.9417 72.2778 52.8489 34.9122 4.9076 5.6812 0.8768 13.0159 10.4867 40.0868 2.1352 3.0590 25.6759 22.6806
temp: 298.150 k
press: 1.00000 atm
elementType: 8 8 8 6 6 6 6 6 6 6 6 6 6 6 6 6 6 6 6 6 6 1 1 1 1 1 1 1 1 1 1 1 1 1 1 1 1 1 1 1 1
symmnumber: 1
zpe: 877376.1 jmol-1
zpe.correction: 0.334175 hartree
zpe.thermalcorrener: 0.354755 hartree
zpe.thermalcorrenthalpy: 0.355699 hartree
zpe.thermalcorrgfe: 0.281798 hartree
zpe.sumelectzpe: -922.066094 hartree
zpe.sumelectthermal: -922.045514 hartree
zpe.sumelectthermalent: -922.044570 hartree
zpe.sumelectthermalfe: -922.118471 hartree
dipole: -0.1210 0.5867 0.1087
dipole: 0.6089
quadrupole: -113.4586 -113.6235 -124.6810
quadrupole: 3.3178 -0.6747 -2.8683
quadrupole: 3.7958 3.6309 -7.4266 3.3178 -0.6747 -2.8683
hfenergy: -922.4002691 hartree
pointgroup: C01 [X(C18H20O3)]
dipole: 0.0502944 -0.2327439 0.0261381 debye
polarizability: 300.03612|-13.1956475|222.9877545|3.7228139|12.0297275|120.2195174 unknown
InChI: InChI=1S/C18H20O3/c1-13(2)12-21-17-9-14(10-18(19)20)8-16(11-17)15-6-4-3-5-7-15/h3-9,11,13,19H,10,12H2,1-2H3
charge 0 multiplicity 1
41 atoms
O  2.106608 1.504355 -0.214516
O  0.541399 -4.708297 -1.102288
O  2.556801 -3.698785 -0.547854
C  4.395073 2.297877 -0.421773
C  3.515417 1.066152 -0.158921
C  1.108584 0.544229 -0.003082
C  -1.315459 0.155212 0.097439
C  0.266308 -1.701991 0.449272
C  4.205548 3.36881 0.675958
C  5.874273 1.859243 -0.536946
C  -0.219151 1.028456 -0.084678
C  1.362147 -0.821619 0.264087
C  -1.055785 -1.220208 0.365278
C  -2.716557 0.663154 0.011603
C  0.522755 -3.178902 0.767918
C  -3.760916 -0.154842 -0.501599
C  -3.046195 1.978034 0.442111
C  1.335819 -3.856463 -0.323557
C  -5.086573 0.322875 -0.579835
C  -4.370612 2.458421 0.362496
C  -5.399298 1.632845 -0.148191
H  4.074575 2.727428 -1.392081
H  3.688158 0.284147 -0.927122
H  3.731624 0.638117 0.843485
H  4.791168 4.276883 0.443058
H  4.548279 2.987335 1.657721
H  3.143278 3.652249 0.768368
H  6.52046 2.732663 -0.737383
H  6.024815 1.130736 -1.355595
H  6.224292 1.393449 0.404611
H  -0.369667 2.084946 -0.326681
H  2.380851 -1.21656 0.314562
H  -1.892165 -1.906306 0.537545
H  -0.430353 -3.713841 0.895686
H  1.104337 -3.263384 1.704704
H  -3.527774 -1.160437 -0.869657
H  -2.26486 2.617398 0.868445
H  -5.873046 -0.322857 -0.986616
H  -4.601763 3.472503 0.707657
H  -6.428147 2.004575 -0.209093
H  1.098756 -5.107603 -1.825336
