program: Gaussian 09
title: 000043821
version: EM64L-G09RevD.01
frameworkgroup: C1[X(C17H22N2O)]
method: RPBEPBE
basis: SDD
operation: Freq
keyword: #p
keyword: freq=noraman
keyword: PBEPBE/SDD
title: #p freq=noraman PBEPBE/SDD
converged: YES YES NO NO
title: Mulliken charges:
elementType: O N N C C C C C C C C C C C C C C C C C H H H H H H H H H H H H H H H H H H H H H H
charge: -0.269951 -0.387675 -0.000860 0.471979 -0.105614 -0.110689 -0.100392 -0.529213 -0.511960 -0.530600 -0.450623 -0.450933 -0.451233 -0.520288 0.175986 0.286783 -0.283267 -0.315827 -0.331191 -0.335998 0.197124 0.201121 0.198371 0.183398 0.197387 0.216072 0.203683 0.197622 0.209001 0.198134 0.191738 0.192466 0.199842 0.197183 0.197402 0.258689 0.226613 0.306059 0.273300 0.218183 0.246060 0.242117
chargesum: 0.00000
title: Mulliken charges with hydrogens summed into heavy atoms:
elementType: O N N C C C C C C C C C C C C C C C C C
charge: -0.269951 -0.081616 -0.000860 0.471979 0.091510 0.090432 0.097979 -0.148429 -0.092204 -0.123977 -0.060751 -0.058624 -0.056647 -0.034986 0.175986 0.286783 -0.009967 -0.097643 -0.085131 -0.093880
polarizability: 2.40744295e+02 -5.10167773e+00 1.78937907e+02 -1.42663767e+01 -9.85224709e+00 1.40353433e+02
1716.lowfreq: -40.1934 -16.0577 -0.0008 -0.0007 -0.0007 8.3266 20.5028 21.4642 39.8452
frequency: -11.6202 19.4709 38.7765 51.5201 125.2106 147.7252 176.9237 237.4816 248.3775 294.7166 298.2068 318.4089 355.8050 365.5466 383.0799 391.3596 393.0755 416.9258 420.4778 423.1489 470.3400 518.3603 552.6682 605.2703 635.9382 638.7285 654.2603 659.9464 692.6959 705.7997 753.4858 767.4677 782.6887 806.2883 811.8701 837.4113 866.6991 870.2185 871.7762 890.9536 898.4009 910.3786 944.2432 956.3477 957.9447 965.0637 969.0781 981.2440 988.0983 996.6158 1025.2939 1046.8626 1048.1282 1056.3338 1061.3523 1084.8309 1095.5428 1102.5155 1104.6815 1107.0766 1111.8978 1127.7466 1154.1300 1180.9315 1184.2623 1218.6367 1222.2276 1251.8504 1267.1810 1278.4748 1287.4669 1289.7231 1300.1585 1303.0410 1308.6309 1309.8102 1313.3945 1324.2109 1324.3350 1338.7156 1343.3055 1347.5991 1356.9056 1361.3129 1366.0747 1398.6856 1447.9380 1449.7383 1451.6343 1458.5722 1460.2466 1461.4109 1464.8452 1481.1604 1495.7887 1545.5184 1582.0656 1602.3806 2940.4651 2950.9647 2961.4304 2962.4461 2964.0744 2967.0227 2970.9533 2992.6023 2994.7779 2997.6960 3005.9950 3009.1670 3018.8650 3021.4834 3027.8935 3029.2981 3056.7136 3123.4254 3139.4380 3147.5609 3173.7745 3560.2413
redmass: 4.3242 4.1446 4.6510 6.2729 5.3274 4.1528 4.1353 3.1926 5.1620 1.9617 2.8530 2.6166 1.9894 2.4911 4.3945 4.6857 4.3700 2.1590 1.8722 1.6975 2.9586 3.4745 1.4428 2.6776 3.8368 3.9228 5.8853 6.8532 4.1060 4.1223 2.8863 3.5773 2.9215 2.8862 2.9918 1.6793 1.5842 1.5816 1.5805 1.2626 2.6682 2.7763 2.1906 2.0864 3.1232 1.9027 2.1924 2.4752 1.4548 2.3018 3.1654 1.7728 1.7737 1.8121 2.0797 1.5894 1.6613 1.0193 1.3247 1.2636 1.0184 3.2747 3.5107 1.2373 1.2179 1.2696 1.1806 1.5678 2.2572 1.8229 1.8894 1.8857 6.0575 2.1996 1.9115 1.5304 1.5507 1.3141 1.5248 1.4413 1.4310 1.4466 1.4710 1.6220 1.4704 1.8595 1.0953 1.0865 1.0943 1.6860 1.1385 1.0951 1.1028 1.0958 1.9211 7.4855 5.5998 7.6234 1.0586 1.0602 1.0634 1.0607 1.0617 1.0607 1.0642 1.0840 1.0840 1.1021 1.0844 1.1013 1.1030 1.1026 1.1021 1.1020 1.0973 1.0873 1.0897 1.0973 1.0963 1.0769
irintensity: 0.3084 0.7557 0.2319 5.2838 4.2697 3.7384 1.6542 9.8237 0.4720 0.0038 9.2225 1.4498 1.1658 0.3008 2.9429 0.6918 0.8271 2.8329 0.5661 0.1263 9.2772 15.9133 73.7260 44.8424 0.0703 0.7787 10.1760 1.3773 23.1376 6.9594 13.5763 0.3727 0.8119 3.0260 0.7022 33.1973 0.0381 0.1124 0.0600 3.5094 3.8626 0.8456 0.4688 5.4751 2.1246 2.2711 6.0145 6.3890 1.2766 1.0287 0.4812 0.0663 0.2602 1.2454 12.0060 2.8967 2.9755 0.2031 3.5448 6.2701 0.2942 1.2832 6.7528 8.6894 1.1510 9.1473 7.4903 9.0929 82.0159 24.9746 1.9617 0.0194 0.1187 13.7431 9.3917 17.7770 4.2728 0.0099 1.0695 7.4810 6.5448 6.2306 1.2277 4.0636 2.0317 11.1571 7.7161 6.3753 5.8060 35.7766 13.5225 16.9320 32.2307 1.2899 245.4400 51.5852 7.2494 104.3102 44.4232 35.1952 19.7082 29.7762 19.7720 48.8233 46.0139 141.8604 153.8400 41.2059 44.1749 22.2539 7.5951 39.4558 103.1722 56.8543 7.3002 8.9271 29.8763 16.7687 5.7106 11.6677
temp: 298.150 k
press: 1.00000 atm
elementType: 8 7 7 6 6 6 6 6 6 6 6 6 6 6 6 6 6 6 6 6 1 1 1 1 1 1 1 1 1 1 1 1 1 1 1 1 1 1 1 1 1 1
symmnumber: 1
zpe: 944974.7 jmol-1
zpe.correction: 0.359922 hartree
zpe.thermalcorrener: 0.375453 hartree
zpe.thermalcorrenthalpy: 0.376397 hartree
zpe.thermalcorrgfe: 0.316369 hartree
zpe.sumelectzpe: -844.272126 hartree
zpe.sumelectthermal: -844.256595 hartree
zpe.sumelectthermalent: -844.255651 hartree
zpe.sumelectthermalfe: -844.315679 hartree
dipole: 3.4541 1.6463 -2.1907
dipole: 4.4091
quadrupole: -132.9088 -122.9097 -118.9201
quadrupole: 3.2238 1.9561 0.1851
quadrupole: -7.9960 2.0032 5.9928 3.2238 1.9561 0.1851
hfenergy: -844.6320482 hartree
pointgroup: C01 [X(C17H22N2O1)]
dipole: 1.3591694 -0.57707 0.9103609 debye
polarizability: 240.804549|6.1252213|177.0394109|13.6388433|-12.9149922|142.1916747 unknown
InChI: InChI=1S/C17H22N2O/c20-16(15-1-3-18-4-2-15)19-11-17-8-12-5-13(9-17)7-14(6-12)10-17/h1-4,12-14,19H,5-11H2
charge 0 multiplicity 1
42 atoms
O  -1.692143 2.100267 -0.705574
N  -0.814136 0.657527 0.903804
N  -5.537213 -1.206167 -0.074806
C  1.687436 0.532581 0.443947
C  3.126224 -1.565544 0.685715
C  2.731102 -0.559577 -1.609773
C  4.210611 0.642539 0.064113
C  1.886584 -0.800021 1.225788
C  1.494661 0.205681 -1.064737
C  2.970641 1.400155 0.609161
C  2.913393 -1.883692 -0.819531
C  4.392266 -0.681825 0.854283
C  3.998846 0.321915 -1.440632
C  0.485129 1.341882 1.00367
C  -1.80982 1.075148 0.037108
C  -3.076491 0.246866 0.031527
C  -4.26577 0.855604 -0.438932
C  -3.141192 -1.112886 0.429758
C  -5.45906 0.102846 -0.467088
C  -4.380458 -1.789575 0.357965
H  3.251856 -2.509007 1.253268
H  2.576298 -0.785658 -2.68319
H  5.11075 1.276513 0.188023
H  0.986353 -1.441311 1.117573
H  2.015685 -0.585383 2.307794
H  1.341495 1.144437 -1.633208
H  0.580038 -0.405257 -1.201338
H  3.121888 1.649915 1.680478
H  2.843921 2.358961 0.06559
H  3.783892 -2.445042 -1.214345
H  2.021682 -2.529988 -0.950058
H  4.563959 -0.463961 1.9280
H  5.284501 -1.224982 0.483706
H  4.886359 -0.206543 -1.843083
H  3.886571 1.261751 -2.01776
H  0.379226 2.289116 0.4441
H  0.678316 1.589602 2.067699
H  -1.003384 -0.117348 1.540342
H  -4.234445 1.89466 -0.779557
H  -2.252707 -1.66546 0.756648
H  -6.39589 0.550085 -0.816985
H  -4.459172 -2.842923 0.650137
