program: Gaussian 09
title: 000043809
version: EM64L-G09RevD.01
frameworkgroup: C1[X(C14H15N)]
method: RPBEPBE
basis: SDD
operation: Freq
keyword: #pfreq=noraman
keyword: PBEPBE/SDD
title: #p freq=noraman PBEPBE/SDD
converged: NO YES NO NO
title: Mulliken charges:
elementType: N C C C C C C C C C C C C C C H H H H H H H H H H H H H H H
charge: -0.202399 -0.518376 -0.518367 0.240502 0.240501 -0.409867 -0.409872 -0.413696 -0.413681 0.471783 -0.365150 -0.365147 -0.222011 -0.222014 -0.250279 0.213868 0.211248 0.213865 0.211255 0.203349 0.202930 0.203345 0.202934 0.262917 0.262921 0.243097 0.243097 0.226547 0.226548 0.230153
chargesum: 0.00000
title: Mulliken charges with hydrogens summed into heavy atoms:
elementType: N C C C C C C C C C C C C C C
charge: -0.202399 -0.093259 -0.093248 0.240502 0.240501 -0.003588 -0.003594 -0.150779 -0.150760 0.471783 -0.122053 -0.122049 0.004536 0.004534 -0.020126
polarizability: 2.47471229e+02 -7.48693349e-04 1.47186852e+02 -4.31038533e-04 3.55766285e+00 8.33770088e+01
1716.lowfreq: -6.9031 -0.0008 -0.0008 -0.0005 5.8746 23.6179 54.5304 54.7535 100.7570
frequency: 54.2828 54.7392 100.7546 122.7612 201.6674 231.9694 277.1684 298.9544 319.3451 346.3320 407.9193 447.5184 460.8528 485.9836 535.5160 607.8141 621.7189 631.1214 651.3670 652.2300 696.0435 710.2101 736.7651 763.5426 773.2114 822.4916 835.6062 852.7144 904.0863 909.0858 934.6109 935.1980 965.5556 967.1614 986.8318 987.6420 1024.1932 1049.3751 1078.6829 1084.1940 1087.1857 1130.8081 1145.4455 1164.1884 1172.6543 1189.8695 1199.3947 1218.6949 1241.0298 1258.9247 1271.7106 1318.9716 1319.2679 1333.5505 1341.9592 1344.0475 1385.2950 1394.6031 1402.2577 1449.0833 1461.6978 1463.4614 1468.9074 1475.4071 1496.3487 1530.6991 1578.0614 1596.3478 1616.5627 2956.8360 2957.1460 2975.8956 2976.4099 3014.9931 3017.3190 3036.5425 3045.1251 3128.3478 3136.1172 3151.9854 3158.7642 3170.5192 3226.2475 3231.6522
redmass: 3.3765 4.2111 4.1628 2.8523 2.8321 3.7111 4.6776 3.2216 1.7551 4.0033 2.8987 3.0244 4.2651 2.7623 3.2222 4.7417 4.1705 3.1012 2.4301 3.4336 1.9801 1.6213 3.7262 1.6266 1.4245 1.5880 1.2609 2.2497 1.4415 1.4613 6.3757 2.5293 2.1618 1.3950 5.6006 1.3058 2.4627 2.0542 1.8061 1.5754 1.9541 1.1446 1.3580 2.8293 1.0739 1.1313 1.5090 1.7232 1.2919 1.2518 2.7558 1.4492 1.4773 1.5565 1.3855 1.4770 9.0703 4.6247 3.4952 2.4553 1.1251 1.0873 1.0828 1.0992 2.8398 4.6927 7.3953 6.6596 6.1683 1.0640 1.0642 1.0604 1.0652 1.0946 1.0953 1.0992 1.1044 1.0847 1.0884 1.0922 1.0960 1.1013 1.0954 1.0998
irintensity: 0.9565 0.7766 0.0581 0.0887 1.8431 0.8321 0.3448 5.8247 0.0000 2.8177 0.7818 0.4971 0.4866 7.7539 8.9457 2.4661 1.4545 0.6824 0.6488 6.1594 36.8528 2.8495 0.7112 112.3293 35.9129 9.8732 0.1162 5.9252 8.0270 3.5309 8.6403 3.6634 6.0871 0.2598 0.5718 0.2831 0.7776 62.1696 0.0599 9.5071 3.8067 1.0680 4.4342 1.1637 0.0601 1.7392 7.0098 51.3406 2.5957 0.6053 2.8047 28.4368 3.1058 1.2299 0.8330 16.6606 0.6402 168.3632 12.1712 5.0195 29.7642 10.8535 12.2424 0.0313 177.5378 47.4295 0.7891 4.7727 124.3749 74.2082 13.8390 27.6396 45.5783 74.1994 7.9826 89.1958 77.7194 4.4833 7.5099 28.4158 23.8999 10.9109 0.5214 0.0012
temp: 298.150 k
press: 1.00000 atm
elementType: 7 6 6 6 6 6 6 6 6 6 6 6 6 6 6 1 1 1 1 1 1 1 1 1 1 1 1 1 1 1
symmnumber: 1
zpe: 662537.1 jmol-1
zpe.correction: 0.252347 hartree
zpe.thermalcorrener: 0.264429 hartree
zpe.thermalcorrenthalpy: 0.265373 hartree
zpe.thermalcorrgfe: 0.213734 hartree
zpe.sumelectzpe: -596.168857 hartree
zpe.sumelectthermal: -596.156775 hartree
zpe.sumelectthermalent: -596.155831 hartree
zpe.sumelectthermalfe: -596.207470 hartree
dipole: 0.4072 0.0000 0.0000
dipole: 0.4072
quadrupole: -78.3634 -80.5800 -93.7883
quadrupole: -0.0003 0.0001 0.9757
quadrupole: 5.8805 3.6639 -9.5444 -0.0003 0.0001 0.9757
hfenergy: -596.4212042 hartree
pointgroup: C01 [X(C14H15N1)]
dipole: -0.1602105 0.0000025 -0.0000248 debye
polarizability: 247.4712286|0.0084852|147.1610327|0.0058213|-3.7820421|83.4028286 unknown
InChI: InChI=1S/C14H15N/c1-2-8-14(9-3-1)15-10-12-6-4-5-7-13(12)11-15/h1-3,8-11H,4-7H2
charge 0 multiplicity 1
30 atoms
N  -0.343706 0.000062 0.000584
C  3.080923 -1.500738 -0.379527
C  3.080664 1.501421 0.380826
C  1.811389 -0.706687 -0.157245
C  1.811276 0.707155 0.15847
C  4.302041 -0.745117 0.211301
C  4.302004 0.745898 -0.209675
C  0.479837 -1.117223 -0.239518
C  0.479655 1.117459 0.240796
C  -1.772087 -0.00004 0.000598
C  -2.487623 -1.17654 0.343676
C  -2.487757 1.176342 -0.342599
C  -3.897842 -1.173861 0.333417
C  -3.89798 1.173457 -0.332525
C  -4.61342 -0.000258 0.000389
H  3.003232 -2.51044 0.06858
H  3.249014 -1.653706 -1.466234
H  3.002923 2.51103 -0.067489
H  3.248517 1.654623 1.467536
H  4.276217 -0.80683 1.318178
H  5.237924 -1.23421 -0.121148
H  4.276436 0.807579 -1.316561
H  5.237753 1.235108 0.122975
H  0.05475 -2.083506 -0.499448
H  0.054402 2.083678 0.500694
H  -1.942819 -2.077734 0.64302
H  -1.943048 2.077605 -0.64191
H  -4.438028 -2.088526 0.602413
H  -4.438267 2.088037 -0.601608
H  -5.708481 -0.000337 0.000335
