program: Gaussian 09
title: 000005255
version: EM64L-G09RevD.01
frameworkgroup: C1[X(C11H16N2O8)]
method: RPBEPBE
basis: SDD
operation: Freq
keyword: #p
keyword: freq=noraman
keyword: PBEPBE/SDD
title: #p freq=noraman PBEPBE/SDD
converged: YES YES NO NO
title: Mulliken charges:
elementType: O O O O O O O O N N C C C C C C C C C C C H H H H H H H H H H H H H H H H
charge: -0.263581 -0.410396 -0.228654 -0.412686 -0.413632 -0.224592 -0.231492 -0.329103 -0.391243 -0.370048 -0.152409 -0.420852 -0.203398 0.235810 -0.563073 -0.509520 0.170858 0.189349 0.185818 0.319861 -0.770621 0.305332 0.255724 0.245550 0.309442 0.367350 0.297871 0.262960 0.264949 0.285405 0.317085 0.216066 0.262927 0.261362 0.381466 0.381649 0.378467
chargesum: 0.00000
title: Mulliken charges with hydrogens summed into heavy atoms:
elementType: O O O O O O O O N N C C C C C C C C C C C
charge: -0.263581 -0.028930 -0.228654 -0.031037 -0.035166 -0.224592 -0.231492 -0.329103 -0.023892 -0.052963 0.152923 0.080421 0.106044 0.235810 -0.002243 0.040835 0.170858 0.189349 0.185818 0.319861 -0.030266
polarizability: 1.84166220e+02 7.17910794e+00 1.52693543e+02 8.83516180e+00 -6.02215471e+00 1.32451703e+02
1716.lowfreq: -5.8299 -1.5842 -0.0010 -0.0006 -0.0003 2.7696 14.4411 20.4262 25.6293
frequency: 13.8001 20.3934 25.6011 29.0965 32.7467 43.9056 50.7169 60.9424 76.0530 78.9008 95.7932 104.0210 108.6411 133.7037 172.4045 189.9873 205.7310 223.9833 249.1410 268.5928 307.5753 330.8833 346.7878 418.3434 428.5804 437.7848 465.6699 499.2326 509.4602 537.1749 549.3525 560.7778 572.2918 599.4523 601.7495 619.1906 638.1525 642.0079 659.9463 679.2947 710.8576 751.1255 774.8462 820.7710 846.7062 862.6643 872.7517 897.4679 939.0450 946.7499 958.2151 999.6347 1015.1231 1033.4779 1045.3331 1048.2720 1067.8906 1085.3119 1101.2768 1119.6075 1140.6152 1185.3220 1210.5996 1229.1540 1239.3845 1253.0298 1255.3063 1267.1469 1271.5346 1292.3339 1305.4487 1329.3511 1331.6830 1358.6460 1372.7145 1388.7059 1393.2310 1437.4780 1444.4928 1449.4055 1462.8252 1464.2363 1491.0162 1542.1906 1583.9781 1633.5422 1665.7993 1666.6762 1668.0053 2986.7568 3000.9561 3013.2470 3021.1734 3025.0570 3036.1800 3044.4750 3079.6601 3093.4234 3098.4063 3110.5667 3240.6661 3510.0493 3514.2807 3516.3390 3543.4865
redmass: 7.0679 11.6582 5.8717 9.3848 7.1006 4.1188 7.6466 7.2351 1.3152 8.2291 5.3454 2.9912 2.7745 5.6840 8.1735 4.2884 3.9144 3.4207 7.1745 7.0536 4.4468 4.0260 5.4307 4.7020 4.0454 3.2128 4.2134 2.5037 1.8393 2.6757 2.4570 1.9214 2.6309 3.3853 2.5853 2.4532 2.2956 1.3716 1.5773 5.1549 4.6373 2.8553 2.3366 2.6191 1.4075 2.4439 3.4814 4.1353 4.2269 2.7123 4.2434 1.6168 2.6433 2.9337 1.8732 2.0206 2.1260 2.6006 2.5247 2.8378 2.0934 1.4121 1.4844 1.4483 1.3351 1.9196 1.5366 1.7797 1.6519 1.4718 1.7494 1.5231 1.3463 1.5657 2.0096 1.7221 1.2323 1.1300 1.0880 1.0594 1.0941 1.1423 1.9382 1.8500 4.6499 4.5469 8.1457 8.7446 8.3978 1.0641 1.0363 1.0820 1.0650 1.0684 1.0776 1.0946 1.0971 1.1029 1.0988 1.1001 1.0857 1.0639 1.0640 1.0642 1.0782
irintensity: 0.3434 0.4636 1.4332 1.3183 0.2492 2.1806 2.4040 1.6766 0.2199 2.7788 2.5397 9.3414 1.1965 10.5356 1.3218 10.7464 7.2896 5.1424 10.7867 1.1845 1.4861 3.1000 0.1071 32.4324 8.3518 15.1413 26.9525 69.2211 22.5630 39.8743 18.8505 176.8601 63.1601 10.5944 12.9931 7.4876 67.3264 137.5923 98.3670 11.1138 15.6626 4.1133 30.4411 12.1880 83.6086 2.5019 16.5700 3.8166 15.6865 19.7078 8.0131 0.0732 52.5314 327.4122 91.1610 164.7013 135.0322 79.7098 17.4345 15.9931 5.3647 1.7762 15.8593 6.8568 2.0360 11.0191 8.0692 14.3507 41.5182 4.5065 47.1360 37.7556 21.1738 26.2575 69.5541 46.2823 65.9759 78.2450 19.8918 11.6370 63.2660 49.5823 118.7081 440.2283 53.9477 285.6419 62.8783 356.4392 134.7576 8.7528 7.1163 0.8472 9.1461 2.8725 10.9731 4.9908 5.6737 12.8378 11.2287 11.4162 287.6261 28.9039 23.5769 28.3816 24.1673
temp: 298.150 k
press: 1.00000 atm
elementType: 8 8 8 8 8 8 8 8 7 7 6 6 6 6 6 6 6 6 6 6 6 1 1 1 1 1 1 1 1 1 1 1 1 1 1 1 1
symmnumber: 1
zpe: 733631.3 jmol-1
zpe.correction: 0.279425 hartree
zpe.thermalcorrener: 0.302540 hartree
zpe.thermalcorrenthalpy: 0.303485 hartree
zpe.thermalcorrgfe: 0.221094 hartree
zpe.sumelectzpe: -1138.514949 hartree
zpe.sumelectthermal: -1138.491834 hartree
zpe.sumelectthermalent: -1138.490890 hartree
zpe.sumelectthermalfe: -1138.573281 hartree
dipole: 1.6310 -1.0426 3.6352
dipole: 4.1184
quadrupole: -102.3982 -127.0153 -123.1958
quadrupole: -4.0079 -2.9238 -4.2292
quadrupole: 15.1382 -9.4789 -5.6594 -4.0079 -2.9238 -4.2292
hfenergy: -1138.7943742 hartree
pointgroup: C01 [X(C11H16N2O8)]
dipole: -1.2608329 -0.9309729 0.4111238 debye
polarizability: 178.6729484|-10.4526214|131.2684506|11.8340948|-5.2367577|159.370067 unknown
InChI: InChI=1S/C11H16N2O8/c1-5(14)12-7(4-9(17)18)10(19)13-6(11(20)21)2-3-8(15)16/h6-7,12-13,15,17,20H,2-4H2,1H3
charge 0 multiplicity 1
37 atoms
O  -0.4909 0.317179 -2.899451
O  2.429482 -2.516534 -2.194964
O  0.439494 -2.52235 -0.995003
O  -4.991358 2.589156 -2.009441
O  3.714978 -1.232088 3.249748
O  -3.520076 3.476189 -0.446922
O  4.856819 0.186969 1.810527
O  -0.69282 0.520353 1.658605
N  0.556218 0.320506 -0.811802
N  -2.333489 0.254891 0.039522
C  1.740632 -0.402945 -1.264625
C  2.92978 -0.208082 -0.286395
C  -1.724459 1.20144 -0.927024
C  -0.500319 0.566212 -1.654654
C  -2.774935 1.655642 -1.949948
C  2.678508 -0.778992 1.126356
C  1.420909 -1.898965 -1.447886
C  -3.749377 2.658152 -1.363593
C  3.861563 -0.534249 2.041689
C  -1.800708 -0.002143 1.283782
C  -2.57993 -0.949841 2.178376
H  2.033655 -0.025314 -2.261263
H  3.147598 0.872416 -0.218767
H  3.82105 -0.687335 -0.726191
H  -1.373259 2.072201 -0.340144
H  0.39755 0.497925 0.199192
H  -2.252265 2.130136 -2.801928
H  -3.321457 0.804526 -2.39075
H  2.480429 -1.866959 1.102316
H  1.789288 -0.328724 1.612472
H  -3.157151 -0.26837 -0.264932
H  -3.57701 -1.206403 1.782464
H  -1.999152 -1.879231 2.313418
H  -2.696455 -0.48648 3.172149
H  2.215701 -3.481444 -2.31331
H  -5.592337 3.295221 -1.644837
H  4.492204 -1.031263 3.839213
