program: Gaussian 09
title: 000005153
version: EM64L-G09RevD.01
frameworkgroup: C1[X(C12H15N5O5)]
method: RPBEPBE
basis: SDD
operation: Freq
keyword: #p
keyword: freq=noraman
keyword: PBEPBE/SDD
title: #p freq=noraman PBEPBE/SDD
converged: YES YES NO NO
title: Mulliken charges:
elementType: O O O O O N N N N N C C C C C C C C C C C C H H H H H H H H H H H H H H H
charge: -0.241630 -0.422399 -0.446378 -0.442413 -0.332444 -0.149767 -0.064231 -0.073343 -0.629069 -0.628865 -0.106899 -0.139960 -0.242684 -0.038409 -0.335426 0.128594 -0.316625 0.004503 0.184185 0.123407 0.177601 -0.376638 0.287530 0.243260 0.268828 0.252985 0.219271 0.185889 0.235859 0.359732 0.357305 0.346119 0.240707 0.392952 0.317787 0.321841 0.338826
chargesum: 0.00000
title: Mulliken charges with hydrogens summed into heavy atoms:
elementType: O O O O O N N N N N C C C C C C C C C C C C
charge: -0.241630 -0.062666 -0.089073 -0.096294 -0.332444 -0.149767 -0.064231 -0.073343 0.081670 0.031801 0.180631 0.103300 0.026144 0.214576 0.069734 0.128594 -0.080766 0.004503 0.184185 0.123407 0.177601 -0.135931
polarizability: 2.50709073e+02 4.65743372e+00 2.02190686e+02 -8.19207042e-01 1.44774662e+01 1.09813563e+02
1716.lowfreq: -3.2518 -1.3799 -0.0005 -0.0004 0.0005 5.4128 12.6268 28.8920 37.7764
frequency: 12.2934 28.7685 37.7413 46.4209 51.0165 74.9643 103.7492 107.1391 169.7595 185.4302 200.0505 203.9031 225.3545 242.3203 248.8727 258.3636 298.5450 310.8315 318.5995 337.5829 349.1338 361.0836 385.6448 393.6256 444.3469 461.6442 478.4422 504.1098 530.1390 543.4659 558.2287 573.8262 576.5535 599.9007 619.1607 630.7584 668.1670 673.8288 702.9220 720.6632 722.4708 783.4943 790.6336 803.9139 841.7121 860.3031 883.3115 926.5789 929.0180 933.2670 979.0221 983.0138 999.5418 1019.9960 1039.3733 1041.1471 1051.2780 1070.7297 1101.9989 1122.5613 1145.8364 1180.0192 1185.0120 1198.6842 1205.0611 1214.0691 1243.1211 1258.3839 1265.3378 1289.6500 1303.0349 1304.9891 1326.9103 1327.7064 1333.3825 1346.7610 1384.8886 1399.7119 1403.6081 1412.2905 1432.1514 1434.4333 1451.7846 1459.8368 1510.5872 1533.6704 1553.4604 1586.7763 1616.4504 1639.3437 2942.8387 2963.1293 3000.1655 3002.4245 3039.0925 3050.5048 3159.8221 3218.1068 3259.2386 3534.5631 3565.2130 3572.0933 3582.0450 3621.0872 3688.4041
redmass: 5.3733 7.0307 5.3773 3.4405 5.5099 6.3411 6.6885 6.1794 6.2443 3.9700 6.7310 3.2958 4.7711 6.4088 1.4475 4.9565 1.1340 4.6280 4.0509 2.7106 4.6184 1.7874 2.9210 3.5541 1.3361 4.4740 2.7850 5.4343 5.7332 1.4530 3.4466 5.8261 1.2247 5.6041 3.3471 2.6507 6.3006 6.0566 5.4683 3.4790 5.1317 2.5330 3.8846 8.6941 4.7976 1.0781 3.1290 6.0558 4.5181 1.4454 3.5362 4.7154 3.2425 2.8826 2.9954 2.8631 2.1072 3.6421 2.5474 2.1573 3.3294 1.1547 1.3555 1.5506 1.2014 1.1816 1.4243 2.8602 1.2332 1.9353 1.9224 1.2307 1.3589 5.2519 4.4890 2.0219 1.5857 1.5622 2.6591 1.4949 5.9929 1.7351 3.4781 1.0851 5.2640 2.6997 6.8242 2.8509 1.7170 1.8150 1.0566 1.0827 1.0936 1.0958 1.0856 1.0881 1.0920 1.0967 1.0657 1.0449 1.0660 1.0667 1.0668 1.0888 1.1041
irintensity: 1.7328 1.0246 2.6736 9.1159 5.4176 1.1538 2.2675 9.1309 3.1005 17.9667 1.9212 41.1762 14.6330 9.6543 90.4223 8.4236 125.2129 21.0502 11.7550 8.3243 0.4525 72.8070 99.4462 15.6087 100.9799 16.3323 12.5027 12.4730 3.0876 44.4768 8.3213 9.9779 212.5175 21.2509 17.8582 12.2215 1.2426 11.2837 21.8637 83.7865 8.1624 2.5164 11.6007 2.2832 33.9377 143.8118 65.7905 210.3171 36.7380 12.2821 4.3426 52.9925 84.9279 43.0975 27.3226 7.2893 7.7263 99.5646 22.2032 6.4786 37.7582 46.0643 29.9080 51.1497 6.9125 26.2252 22.5617 41.6915 8.9264 54.0724 138.6481 1.2772 6.1661 51.2171 9.9386 29.3917 19.2549 14.0398 30.7205 1.1092 228.4923 19.9330 63.6317 13.9036 95.9354 68.4355 37.0798 386.5291 500.0754 165.6233 49.6194 22.9209 43.3774 45.6266 5.2714 42.6508 26.0225 1.8515 331.0194 51.2783 15.4861 4.7770 14.9923 100.3915 31.1919
temp: 298.150 k
press: 1.00000 atm
elementType: 8 8 8 8 8 7 7 7 7 7 6 6 6 6 6 6 6 6 6 6 6 6 1 1 1 1 1 1 1 1 1 1 1 1 1 1 1
symmnumber: 1
zpe: 737296.8 jmol-1
zpe.correction: 0.280822 hartree
zpe.thermalcorrener: 0.301588 hartree
zpe.thermalcorrenthalpy: 0.302532 hartree
zpe.thermalcorrgfe: 0.229259 hartree
zpe.sumelectzpe: -1114.519064 hartree
zpe.sumelectthermal: -1114.498298 hartree
zpe.sumelectthermalent: -1114.497354 hartree
zpe.sumelectthermalfe: -1114.570627 hartree
dipole: 7.4278 4.8172 2.9514
dipole: 9.3321
quadrupole: -110.2500 -114.0774 -137.6922
quadrupole: -3.1370 8.0474 0.4420
quadrupole: 10.4232 6.5958 -17.0190 -3.1370 8.0474 0.4420
hfenergy: -1114.7998855 hartree
pointgroup: C01 [X(C12H15N5O5)]
dipole: 2.9274811 -1.7867711 -1.3105086 debye
polarizability: 250.7131086|-4.73254|199.0437248|0.7938864|22.1174288|112.9564892 unknown
InChI: InChI=1S/C12H15N5O5/c13-9-6-4(10(14)21)1-17(11(6)16-3-15-9)12-8(20)7(19)5(2-18)22-12/h1,3,5,7-8,12,18-20H,2,13-14H2
charge 0 multiplicity 1
37 atoms
O  2.18519 0.04367 1.281144
O  2.008308 2.156816 -1.685339
O  4.655658 0.569374 -1.430333
O  4.200271 -2.320054 1.59515
O  -3.618822 -2.392928 -0.92126
N  0.096836 0.296038 0.117062
N  -1.179157 2.264097 0.842826
N  -3.609878 1.9782 0.727981
N  -4.641122 0.003449 -0.027513
N  -1.618558 -3.530685 -0.951302
C  1.417901 0.873221 0.305746
C  2.30629 0.941716 -0.953187
C  3.720835 0.901542 -0.353923
C  3.588507 -0.142309 0.792436
C  3.856631 -1.58943 0.368891
C  -1.102101 0.986033 0.378273
C  -0.215957 -0.98959 -0.317251
C  -2.185595 0.115664 0.070157
C  -1.610598 -1.151924 -0.359646
C  -3.496303 0.685656 0.253996
C  -2.348042 -2.370724 -0.754634
C  -2.470542 2.677871 0.996938
H  1.248771 1.888683 0.708685
H  2.171116 0.039737 -1.589037
H  3.950015 1.897551 0.076198
H  4.250193 0.084792 1.647084
H  4.691945 -1.608046 -0.361993
H  2.951561 -2.014135 -0.116295
H  0.580878 -1.695212 -0.544985
H  2.594533 2.192898 -2.483416
H  5.573671 0.838351 -1.178126
H  4.391167 -3.266607 1.37779
H  -2.611424 3.693663 1.37865
H  -4.560988 -0.955021 -0.413082
H  -5.529647 0.476919 0.126991
H  -0.626655 -3.603871 -0.740159
H  -2.129586 -4.365206 -1.235715
