program: Gaussian 09
title: 000043790
version: EM64L-G09RevD.01
frameworkgroup: C1[X(C8H6N4O4)]
method: RPBEPBE
basis: SDD
operation: Freq
keyword: #pfreq=noraman
keyword: PBEPBE/SDD
title: #p freq=noraman PBEPBE/SDD
converged: NO NO NO NO
title: Mulliken charges:
elementType: O O O O N N N N C C C C C C C C H H H H H H
charge: -0.105424 -0.179936 -0.229697 -0.186830 -0.141853 -0.057607 0.021974 0.012457 -0.419346 -0.396359 0.353852 0.170630 -0.368589 -0.061369 0.383100 -0.387083 0.258276 0.253772 0.257786 0.272452 0.254474 0.295320
chargesum: 0.00000
title: Mulliken charges with hydrogens summed into heavy atoms:
elementType: O O O O N N N N C C C C C C C C
charge: -0.105424 -0.179936 -0.229697 -0.186830 -0.141853 -0.057607 0.021974 0.012457 0.092702 0.133878 0.353852 0.170630 -0.114115 -0.061369 0.383100 -0.091763
polarizability: 2.50311253e+02 1.47851734e+00 1.56207560e+02 -4.05057214e+00 3.05268044e+00 5.73285136e+01
1716.lowfreq: -2.1180 0.0004 0.0006 0.0011 9.0005 11.8805 58.0774 69.9473 95.6606
frequency: 58.0372 69.9415 95.6594 110.6369 138.0796 170.0010 177.1924 220.9874 275.6359 294.1138 315.1754 350.1642 357.6005 392.2489 422.2140 458.0129 526.1268 536.9364 565.5108 592.5824 625.9534 674.3857 677.7323 678.5436 721.4528 759.6534 801.3812 827.3190 844.1559 918.9762 933.1321 961.7968 975.5838 1003.7014 1072.8921 1100.9308 1116.7017 1126.5591 1139.0408 1140.2630 1163.4512 1211.3294 1226.5924 1290.7849 1322.1960 1356.5113 1408.4624 1442.5702 1459.0190 1476.5937 1508.3169 1554.7802 1581.1049 1590.3169 3072.6758 3090.5336 3161.4739 3178.7651 3183.7751 3207.2049
redmass: 8.2435 6.6758 7.7550 3.3643 3.7109 4.4450 12.5128 6.2934 7.1807 9.5281 8.6551 11.3284 6.8477 11.5440 7.9888 10.8213 5.6776 5.4325 9.2351 6.0879 8.2499 7.4368 8.9183 9.7122 11.7863 8.4479 1.0328 1.5311 4.4142 7.0909 8.1625 7.7187 1.3282 1.0909 2.6716 1.3359 1.4482 1.3284 1.4987 2.4615 3.0612 5.2006 2.7526 2.9763 6.0687 11.4733 3.1414 8.7375 1.0823 1.2577 6.3888 9.7730 8.3256 10.1969 1.0528 1.0584 1.0885 1.0953 1.1170 1.1171
irintensity: 0.5950 1.6531 0.8632 2.2581 0.6407 22.7899 2.1215 1.9692 0.3644 2.2490 10.4178 2.4673 8.7922 1.2954 0.5680 1.1707 1.6939 3.8959 10.8375 5.9295 2.9550 7.0097 14.7136 7.8242 8.2711 10.8264 48.8407 52.5719 4.6640 11.0698 0.0063 64.0892 2.9467 1.8512 2.6724 8.2185 110.2909 3.6345 3.6940 12.8778 21.8140 340.3066 319.4834 0.9599 47.1765 65.5801 50.2393 19.6176 7.4233 18.6153 53.5596 323.6056 291.6910 345.5721 21.9175 24.1362 3.0251 4.6589 3.2287 9.5185
temp: 298.150 k
press: 1.00000 atm
elementType: 8 8 8 8 7 7 7 7 6 6 6 6 6 6 6 6 1 1 1 1 1 1
symmnumber: 1
zpe: 375109.9 jmol-1
zpe.correction: 0.142872 hartree
zpe.thermalcorrener: 0.156182 hartree
zpe.thermalcorrenthalpy: 0.157126 hartree
zpe.thermalcorrgfe: 0.102636 hartree
zpe.sumelectzpe: -826.944968 hartree
zpe.sumelectthermal: -826.931659 hartree
zpe.sumelectthermalent: -826.930715 hartree
zpe.sumelectthermalfe: -826.985204 hartree
dipole: 8.7690 -5.2372 0.8095
dipole: 10.2459
quadrupole: -102.7687 -93.6749 -89.1762
quadrupole: -8.6667 4.1683 -0.2904
quadrupole: -7.5621 1.5317 6.0304 -8.6667 4.1683 -0.2904
hfenergy: -827.0878403 hartree
pointgroup: C01 [X(C8H6N4O4)]
dipole: 3.5351198 1.9329307 0.1272569 debye
dipolederiv: 0.1237045 0.3826687 0.1128385 -0.3803997 -0.3416612 -0.0846463 -0.0982907 -0.0580388 -0.085579 -1.1056545 0.5281216 0.0779866 0.3574507 -0.4717146 -0.067027 0.0722217 -0.0546744 -0.1395651 -0.8899968 0.2609479 0.0505055 0.5763076 -0.7026679 -0.1094506 0.1308901 -0.1171263 -0.2765097 -0.8016029 -0.1381404 -0.0625234 -0.3388681 -0.5403459 -0.1062978 -0.1330012 -0.1041191 -0.2473569 -2.2172383 -0.2972029 0.0593405 0.2018442 -0.1411969 0.1566579 -0.5310415 0.0802814 -0.3429958 1.1148914 -0.6042703 -0.0811739 -0.2560649 0.684274 0.13824 -0.0161015 0.1340322 0.0819365 -0.1797795 -0.3545943 -0.0953347 0.2906548 0.0195696 0.0531412 0.0772706 0.0147886 -0.1075527 2.410656 -0.1559784 0.0414284 -0.1908822 0.958152 0.2182003 0.0696718 0.2155553 0.249673 0.4504312 0.1653572 0.0704986 0.1484218 0.0881969 -0.0821337 0.0909974 -0.1059141 0.2213789 0.6108662 0.0034976 -0.0411681 -0.1696118 0.1254432 -0.0830105 -0.020498 -0.0709849 0.2441158 1.8398669 0.2373648 0.1072804 -0.5680939 0.4011862 0.0247757 0.2686459 0.0733943 0.1308941 -0.336222 0.0276255 0.0080716 -0.077988 -0.4329581 -0.12666 -0.0690627 -0.1186992 0.0330767 -1.0931707 0.0146712 0.0266501 0.6934204 -0.0859853 0.0740957 0.2477734 0.0697825 -0.1935286 0.0610722 -0.2283069 -0.0590504 -0.2644303 0.3499054 0.0509927 -0.0778146 0.0552279 0.1217168 -1.2761969 0.0640923 -0.0187778 -0.470551 -0.1868113 -0.0666633 -0.2110769 -0.0520163 -0.0070618 1.0374512 0.0626888 0.0490428 0.5247717 0.0659546 0.0431773 0.2043395 0.0384374 -0.0373366 0.0555544 -0.0403482 -0.064045 -0.1274559 0.033963 -0.0165175 -0.1184668 -0.0406898 0.0139557 0.001874 0.0329751 -0.0807295 -0.0629905 -0.0318612 0.0689781 0.0662483 0.0935597 0.0402698 -0.0187819 0.0151243 -0.0631361 -0.014567 0.0697631 -0.0232512 0.079755 -0.0055265 -0.0664074 0.0731454 0.042599 -0.0179336 0.1615253 0.0403701 0.0023295 0.000563 0.0208687 0.0566407 0.0278809 -0.0694444 -0.0335553 -0.050715 0.0095481 -0.04633 -0.0259577 -0.0480826 0.1548304 0.1112492 0.0505518 0.0137847 0.0182218 0.088876 -0.0186005 -0.007065 -0.0200556 0.1554053 unknown
polarizability: 250.0363412|-6.1918351|149.6236985|1.9302477|25.3904283|64.1872878 unknown
InChI: InChI=1S/C8H6N4O4/c13-11(14)5-1-2-6(10-3-4-10)8-7(5)9-16-12(8)15/h1-2H,3-4H2
charge 0 multiplicity 1
22 atoms
O  -0.200031 -2.55115 -0.716458
O  2.252183 -2.150107 -0.451813
O  -3.714817 1.825128 0.32108
O  -3.71505 -0.376388 -0.320381
N  2.622229 0.768983 0.446598
N  1.093939 -1.647725 -0.389138
N  -1.33241 -1.748936 -0.55516
N  -3.108201 0.71177 0.031858
C  3.611391 1.82795 0.163948
C  3.738429 0.428475 -0.462057
C  1.252213 0.770617 0.290098
C  0.550138 -0.433629 -0.08996
C  0.450271 1.897005 0.580866
C  -0.896701 -0.505016 -0.187729
C  -1.653066 0.683462 0.112118
C  -0.96429 1.844171 0.491671
H  4.26745 2.105857 0.994519
H  3.29929 2.65306 -0.489397
H  3.51415 0.325598 -1.530406
H  4.471217 -0.281846 -0.070754
H  0.939762 2.826182 0.886493
H  -1.566395 2.730241 0.714505
