program: Gaussian 09
title: 000043793
version: EM64L-G09RevD.01
frameworkgroup: C1[X(C17H17N5O5)]
method: RPBEPBE
basis: SDD
operation: Freq
keyword: #p
keyword: freq=noraman
keyword: PBEPBE/SDD
title: #p freq=noraman PBEPBE/SDD
converged: NO YES NO NO
title: Mulliken charges:
elementType: O O O O O N N N N N C C C C C C C C C C C C C C C C C H H H H H H H H H H H H H H H H H
charge: -0.101525 -0.277529 -0.184875 -0.232965 -0.190782 -0.141223 -0.185532 -0.070641 0.022294 0.010439 -0.417893 -0.420904 -0.423590 -0.402721 0.372866 0.473549 0.175346 -0.318034 -0.069519 -0.513220 -0.393571 -0.432793 0.391267 0.350370 -0.215303 -0.395385 -0.535651 0.231024 0.253835 0.269722 0.244769 0.226803 0.242497 0.216959 0.244005 0.265707 0.255013 0.234278 0.293427 0.219627 0.243255 0.222109 0.220901 0.243596
chargesum: 0.00000
title: Mulliken charges with hydrogens summed into heavy atoms:
elementType: O O O O O N N N N N C C C C C C C C C C C C C C C C C
charge: -0.101525 -0.277529 -0.184875 -0.232965 -0.190782 -0.141223 -0.185532 -0.070641 0.022294 0.010439 0.066967 0.093586 0.045709 0.058243 0.372866 0.473549 0.175346 -0.052327 -0.069519 -0.258207 -0.159294 -0.139367 0.391267 0.350370 0.004324 -0.152130 0.150956
polarizability: 4.92198754e+02 -2.02228321e+01 2.19528993e+02 2.16117255e+01 5.65691135e+00 1.61621551e+02
1716.lowfreq: -6.9394 -2.7549 -0.0004 0.0002 0.0005 2.9473 10.9854 26.9177 40.7904
frequency: 10.9495 26.9127 40.7798 63.0668 72.8572 77.3408 96.5301 99.5394 104.0784 143.1777 157.0825 166.8026 192.7362 205.7766 213.5830 230.6726 251.7394 260.6993 265.6750 287.5452 295.9373 324.1047 340.8070 348.3560 369.9446 379.7876 400.6214 412.2839 449.4884 460.9530 486.2868 490.0593 506.7389 525.7766 554.7880 565.9548 579.2831 602.0236 607.0406 615.4036 650.5046 674.0082 676.5042 683.2132 683.9401 693.2531 724.6634 755.2217 758.3968 802.5647 810.8419 830.2314 839.4318 856.7569 875.3959 930.9295 947.3930 951.4599 961.0483 967.3378 972.6169 977.9868 1015.6641 1029.6338 1050.1477 1070.8548 1085.1321 1098.8976 1108.9347 1112.9074 1143.0683 1155.3988 1159.9198 1179.2374 1195.4783 1198.3255 1205.6644 1219.6991 1232.7424 1237.5250 1258.8421 1280.9711 1292.1301 1306.7036 1325.2948 1346.6288 1351.4401 1356.6751 1365.6559 1369.8182 1379.6603 1387.1208 1398.3579 1430.8059 1435.2972 1458.3209 1460.6098 1466.8367 1469.8031 1476.8239 1485.8658 1488.4914 1494.5355 1498.1381 1549.4423 1571.5271 1577.1907 1577.6259 1628.0597 2923.7225 2931.2908 2952.5444 2960.4705 3017.3951 3032.1533 3033.1852 3040.2976 3048.0566 3100.3777 3124.8567 3131.9236 3161.7697 3168.3774 3170.5433 3177.3026 3192.3506
redmass: 5.8118 6.5148 5.5199 11.1926 4.7593 5.0368 5.9390 4.2792 4.2916 7.6219 4.2692 4.5482 5.1736 2.0945 4.0399 4.1410 4.8765 3.9753 1.9032 1.9786 4.3759 6.6753 4.8842 7.2942 3.7891 8.4297 10.1085 6.7585 3.0156 9.8534 4.2903 5.1175 3.9413 5.5511 4.3733 7.7729 7.1348 4.3933 3.6710 3.6517 3.9254 6.0927 8.9033 4.2422 2.4271 4.5916 10.8533 1.6731 5.0280 2.0865 2.5991 1.5025 1.8349 4.1341 1.5945 8.0985 4.3528 1.3531 2.7821 3.0924 1.3917 5.5523 3.2809 2.5765 1.8728 2.0835 2.0746 1.6939 2.2299 1.2590 7.9318 1.3829 2.8354 1.4783 1.9749 1.5253 2.5775 1.5822 2.4201 1.7722 1.4423 1.5035 1.8398 1.4920 4.5598 1.3361 3.6416 2.0011 1.4698 1.5422 1.9200 3.3579 4.9303 7.4554 1.2755 2.1091 1.2095 1.0506 1.1238 1.1122 1.3423 1.1155 4.6434 1.9211 10.0478 6.5171 8.8162 6.3212 6.5715 1.0687 1.0708 1.0641 1.0329 1.0828 1.0849 1.0794 1.0960 1.1039 1.1045 1.0994 1.0870 1.0924 1.0894 1.0906 1.0959 1.0931
irintensity: 0.8487 1.3979 1.1403 1.0218 1.0793 7.3691 1.0049 1.7687 2.2723 1.1211 5.9022 5.1794 1.4742 0.4975 2.2722 2.3718 6.6258 1.2041 0.9431 0.3469 1.0720 0.1240 3.2981 0.8213 10.9777 2.3113 0.8322 2.1784 5.8428 0.4750 2.8645 0.8664 5.9553 5.6861 12.1880 3.3890 8.6979 2.6796 1.1606 0.9113 0.1483 6.7310 13.5909 2.3002 35.0981 3.3976 7.6955 32.9625 28.2679 15.2629 32.8780 5.5916 44.4330 1.1511 6.9699 2.4649 4.1022 1.4765 43.8806 41.7771 11.4694 18.7952 154.6742 7.0304 1.3752 5.0380 1.1418 8.0810 0.3836 0.2368 39.0290 21.4976 86.7887 234.3115 224.0830 35.5231 282.4482 151.1000 358.2847 2.1152 21.1407 53.2733 7.6999 0.9112 60.8802 2.3180 54.4710 12.5181 3.4296 4.3813 152.5911 92.0425 39.7567 11.0317 10.7530 47.9121 129.7569 12.5735 102.8853 18.4763 104.5619 5.3861 21.4319 103.4864 330.2126 475.9588 132.1789 86.6248 397.5651 87.8622 21.8810 42.6922 80.7266 4.2470 2.9517 35.7627 21.3519 48.4559 12.4873 26.8597 14.1883 21.1728 2.1193 11.3515 6.2636 7.9006
temp: 298.150 k
press: 1.00000 atm
elementType: 8 8 8 8 8 7 7 7 7 7 6 6 6 6 6 6 6 6 6 6 6 6 6 6 6 6 6 1 1 1 1 1 1 1 1 1 1 1 1 1 1 1 1 1
symmnumber: 1
zpe: 864071.1 jmol-1
zpe.correction: 0.329107 hartree
zpe.thermalcorrener: 0.352694 hartree
zpe.thermalcorrenthalpy: 0.353638 hartree
zpe.thermalcorrgfe: 0.274539 hartree
zpe.sumelectzpe: -1305.688222 hartree
zpe.sumelectthermal: -1305.664635 hartree
zpe.sumelectthermalent: -1305.663691 hartree
zpe.sumelectthermalfe: -1305.742790 hartree
dipole: -11.1362 -2.1051 0.1329
dipole: 11.3342
quadrupole: -208.5365 -165.9601 -152.7951
quadrupole: 0.7643 -6.8482 8.4668
quadrupole: -32.7726 9.8038 22.9688 0.7643 -6.8482 8.4668
hfenergy: -1306.017329 hartree
pointgroup: C01 [X(C17H17N5O5)]
dipole: 4.3654131 -0.5259572 0.7424531 debye
polarizability: 490.1659698|37.215261|185.7937531|13.96312|-27.2548027|197.389575 unknown
InChI: InChI=1S/C17H17N5O5/c1-26-13-4-2-3-12(11-13)19-7-9-20(10-8-19)15-6-5-14(21(23)24)16-17(15)22(25)27-18-16/h2-6,11H,7-10H2,1H3
charge 0 multiplicity 1
44 atoms
O  -4.142919 1.974011 -1.825453
O  6.848426 0.414953 1.59836
O  -1.77084 2.533477 -1.444162
O  -6.389012 -2.387005 1.06117
O  -6.896584 -0.868334 -0.579805
N  -0.504582 0.079762 0.201207
N  2.390492 -0.191381 -0.1541
N  -2.694168 1.693006 -1.22755
N  -5.007175 0.981704 -1.345053
N  -6.06824 -1.426188 0.244865
C  0.383283 -0.461292 1.262108
C  0.192301 0.53554 -1.037377
C  1.798988 0.130286 1.152489
C  1.459587 -0.30866 -1.287683
C  -1.86089 -0.191056 0.261688
C  3.781405 -0.318114 -0.326547
C  -2.848817 0.526821 -0.528354
C  -2.39267 -1.189342 1.12332
C  -4.255258 0.143796 -0.568967
C  4.682353 0.102913 0.689227
C  4.320588 -0.878027 -1.528746
C  -3.758572 -1.557614 1.104084
C  -4.692629 -0.951986 0.254194
C  6.077569 -0.041817 0.514837
C  5.713022 -0.999001 -1.682761
C  6.616548 -0.5919 -0.674278
C  8.305117 0.325434 1.476561
H  0.450407 -1.567724 1.188364
H  -0.044054 -0.209398 2.249986
H  0.462052 1.602528 -0.960074
H  -0.484209 0.422085 -1.899213
H  1.766472 1.225297 1.345708
H  2.41017 -0.324677 1.953515
H  1.175771 -1.364784 -1.492768
H  1.938729 0.087057 -2.20292
H  -1.721042 -1.750809 1.774693
H  4.340388 0.581329 1.610509
H  3.661263 -1.245901 -2.319783
H  -4.116999 -2.371574 1.741473
H  6.108375 -1.435679 -2.607095
H  7.693426 -0.704963 -0.821163
H  8.676004 0.925424 0.622844
H  8.636388 -0.725066 1.361828
H  8.697637 0.73717 2.41792
