program: Gaussian 09
title: 000043839
version: EM64L-G09RevD.01
frameworkgroup: C1[X(C18H19ClO3)]
method: RPBEPBE
basis: SDD
operation: Freq
keyword: #p
keyword: freq=noraman
keyword: PBEPBE/SDD
title: #p freq=noraman PBEPBE/SDD
converged: YES YES NO NO
title: Mulliken charges:
elementType: Cl O O O C C C C C C C C C C C C C C C C C C H H H H H H H H H H H H H H H H H H H
charge: -0.061198 -0.271028 -0.404587 -0.240907 -0.382600 0.405620 -0.289531 0.497514 0.374335 -0.342254 -0.637865 -0.581368 -0.521347 0.336314 -0.630881 -0.687054 -0.377892 -0.377093 0.210509 -0.226135 -0.226465 -0.105850 0.210297 0.209569 0.211014 0.203509 0.195843 0.194541 0.246588 0.264747 0.286844 0.246146 0.248332 0.212263 0.212093 0.218416 0.244771 0.248301 0.254036 0.254715 0.377737
chargesum: 0.00000
title: Mulliken charges with hydrogens summed into heavy atoms:
elementType: Cl O O O C C C C C C C C C C C C C C C C C C
charge: -0.061198 -0.271028 -0.026850 -0.240907 0.037267 0.405620 0.124991 0.497514 0.374335 0.048131 -0.391277 -0.316621 -0.234503 0.336314 -0.136403 -0.044282 -0.133121 -0.128792 0.210509 0.027901 0.028251 -0.105850
polarizability: 3.44669247e+02 1.25237190e+01 2.13910705e+02 9.06723504e-02 -1.96185383e+01 1.31830781e+02
1716.lowfreq: -8.4075 -3.3846 0.0012 0.0016 0.0021 2.0300 20.0171 22.1785 31.3106
frequency: 19.8880 22.0606 31.2986 35.5273 45.6632 49.4558 60.8529 70.3229 101.9743 111.0740 135.4091 158.1022 171.7008 196.4536 215.6749 228.8482 233.8884 245.3828 285.1881 306.9968 329.3016 365.2270 391.3496 410.7912 428.7870 454.1565 476.7988 485.6881 533.1646 544.8913 564.6442 603.8934 606.5245 629.5684 648.2602 687.4428 699.3878 719.3783 734.6135 742.9954 811.4533 826.3833 828.1750 832.8460 845.6184 880.7209 892.8105 894.8699 899.1900 935.4469 939.2452 940.3446 951.5870 963.0243 982.2428 997.2313 1009.5332 1042.1375 1060.0348 1074.4793 1079.0630 1084.2433 1112.4932 1124.3729 1145.4776 1167.1123 1181.9242 1190.5330 1209.2463 1213.8943 1267.0992 1273.8524 1281.1987 1286.5182 1288.2938 1296.9415 1320.7360 1332.1339 1348.7694 1351.4499 1379.5156 1384.0836 1390.2496 1403.2488 1447.1219 1447.7154 1457.2761 1469.3459 1473.2439 1476.9160 1482.5680 1490.5743 1491.6879 1575.6240 1595.8660 1600.5984 1615.2895 1658.5171 2949.0093 2968.2353 2975.7354 2994.0795 3006.9824 3011.0456 3012.8224 3059.0635 3074.7545 3076.5666 3103.8625 3138.2660 3143.0891 3144.1026 3159.8814 3163.5528 3169.5373 3173.1188 3504.5047
redmass: 6.7162 4.9794 8.1431 4.9150 1.8178 4.1144 4.4018 5.3205 4.1337 3.8947 2.3075 4.5217 4.4845 5.4141 7.4526 1.1657 4.3612 4.2748 5.0781 6.1247 5.1709 3.7098 2.9148 2.9240 3.2826 7.4045 3.5442 3.5750 4.2523 3.6632 3.6766 5.7837 4.6062 6.4619 1.5492 5.0039 2.2857 3.1614 4.4662 1.0853 1.1589 1.4416 1.3877 4.0434 2.6669 1.4297 1.6679 2.1771 2.0009 3.1315 1.4104 1.8568 1.3755 1.3962 5.3606 4.4875 5.0036 3.4194 2.0163 3.0766 1.8699 2.1617 1.3637 2.5846 1.4540 1.6974 1.2334 1.1710 1.8761 1.3708 1.3990 1.2968 1.1777 1.0689 1.3230 1.2642 3.8077 2.1707 1.5336 3.7776 2.2172 2.5157 1.2862 4.3404 1.8477 2.3908 1.5824 1.0805 1.0738 1.0424 1.0831 1.5715 1.6324 6.6521 5.9246 6.2289 6.7001 8.5099 1.0552 1.0589 1.0363 1.0592 1.1045 1.0637 1.1024 1.1044 1.1016 1.0995 1.0980 1.0909 1.0890 1.0888 1.0914 1.0916 1.0956 1.0968 1.0638
irintensity: 0.2785 0.7361 2.4361 0.1738 0.3736 0.3094 0.0119 0.3579 0.6875 0.8745 2.9727 0.3479 0.3493 1.6234 0.2859 0.0040 0.6824 1.0603 0.1973 0.4570 0.5139 2.7663 1.8290 0.4772 1.3769 22.8640 10.0574 17.5279 24.8454 1.1966 37.0049 12.0719 9.7044 2.6481 115.8715 53.3076 18.5024 0.7504 2.9846 9.3254 1.2553 52.6620 57.7466 10.4307 10.7104 6.9324 3.4314 20.5906 28.9348 18.1159 5.8819 19.7937 1.4242 1.7942 1.1539 69.9692 49.1658 39.0218 217.3369 83.9138 26.1853 6.9201 8.8439 8.6831 1.9720 95.1946 49.7481 1.4486 49.5531 0.3009 0.6387 0.2047 0.3487 0.2038 10.8471 1.3110 111.2746 78.7700 2.7299 16.6946 5.4646 44.0404 2.0908 17.4076 63.7044 49.7314 44.2061 1.2120 0.7781 13.0396 15.8569 22.2338 55.0863 17.5205 110.5151 3.8718 127.1362 202.3472 25.6313 33.8927 35.8564 37.4145 23.6574 11.5235 1.1793 16.3644 103.1097 50.6981 4.8935 6.0257 7.5567 8.1446 1.3269 2.2937 8.3063 0.6762 24.0410
temp: 298.150 k
press: 1.00000 atm
elementType: 17 8 8 8 6 6 6 6 6 6 6 6 6 6 6 6 6 6 6 6 6 6 1 1 1 1 1 1 1 1 1 1 1 1 1 1 1 1 1 1 1
symmnumber: 1
zpe: 853015.2 jmol-1
zpe.correction: 0.324896 hartree
zpe.thermalcorrener: 0.346854 hartree
zpe.thermalcorrenthalpy: 0.347798 hartree
zpe.thermalcorrgfe: 0.269460 hartree
zpe.sumelectzpe: -1381.454535 hartree
zpe.sumelectthermal: -1381.432577 hartree
zpe.sumelectthermalent: -1381.431633 hartree
zpe.sumelectthermalfe: -1381.509971 hartree
dipole: 2.8214 1.2908 -0.2455
dipole: 3.1123
quadrupole: -145.9861 -127.2626 -132.3897
quadrupole: -7.8131 2.1844 -3.1288
quadrupole: -10.7733 7.9502 2.8231 -7.8131 2.1844 -3.1288
hfenergy: -1381.7794309 hartree
pointgroup: C01 [X(C18H19Cl1O3)]
dipole: 1.0880752 -0.5558423 0.0806253 debye
polarizability: 343.0154834|-19.1958944|214.1593875|-6.6493805|-21.4062912|133.2358624 unknown
InChI: InChI=1S/C18H19ClO3/c1-2-3-8-22-17-10-13(11-18(20)21)9-15(12-17)14-4-6-16(19)7-5-14/h4-7,9-10,12,20H,2-3,8,11H2,1H3
charge 0 multiplicity 1
41 atoms
Cl -7.023391 1.79444 -0.117678
O  2.192212 1.519425 -0.068114
O  1.015771 -4.769935 -1.069526
O  2.932523 -3.594158 -0.493153
C  4.425255 2.426878 -0.274387
C  -1.155079 -0.009388 0.213146
C  3.622481 1.151713 -0.01126
C  0.518419 -1.789466 0.533907
C  1.244913 0.504452 0.115572
C  5.950144 2.170806 -0.232105
C  -0.826721 -1.37458 0.455859
C  -0.10586 0.922447 0.045931
C  1.567008 -0.850453 0.364196
C  -2.578867 0.428796 0.133538
C  0.849923 -3.260009 0.807728
C  6.76706 3.449748 -0.51554
C  -3.583546 -0.195307 0.923234
C  -2.973936 1.484048 -0.734278
C  1.727665 -3.857476 -0.281244
C  -4.93302 0.211136 0.854257
C  -4.317685 1.906026 -0.816123
C  -5.281114 1.259887 -0.018078
H  4.149482 3.188609 0.47998
H  4.138896 2.83453 -1.262863
H  3.837759 0.378785 -0.778043
H  3.85641 0.732122 0.989675
H  6.215801 1.390992 -0.974673
H  6.230502 1.765332 0.761402
H  -1.626212 -2.118167 0.544594
H  -0.308825 1.986609 -0.108397
H  2.604307 -1.194146 0.410456
H  -0.073203 -3.852661 0.894197
H  1.411615 -3.342946 1.757218
H  6.531099 3.855798 -1.516915
H  6.541325 4.237229 0.227675
H  7.853373 3.250095 -0.478262
H  -3.308055 -0.989956 1.624822
H  -2.229188 1.965829 -1.376722
H  -5.694547 -0.270563 1.474225
H  -4.609773 2.712697 -1.494559
H  1.61038 -5.119714 -1.788593
