program: Gaussian 09
title: 000043643
version: EM64L-G09RevD.01
frameworkgroup: C1[X(C21H28N2O2)]
method: RPBEPBE
basis: SDD
operation: Freq
keyword: #p
keyword: freq=noraman
keyword: PBEPBE/SDD
title: #p freq=noraman PBEPBE/SDD
converged: YES YES NO NO
title: Mulliken charges:
elementType: O O N N C C C C C C C C C C C C C C C C C C C C C H H H H H H H H H H H H H H H H H H H H H H H H H H H H
charge: -0.306820 -0.260595 -0.300818 -0.453534 -0.357338 -0.394016 -0.349546 -0.363412 -0.355216 -0.486092 -0.695510 0.179702 0.314465 0.307085 -0.320013 -0.541485 0.343102 -0.415902 -0.851694 0.344939 -0.358743 -0.386409 -0.207514 -0.194229 -0.253532 0.184106 0.186315 0.215975 0.186930 0.187911 0.189168 0.179164 0.199063 0.194033 0.194198 0.295633 0.215605 0.210182 0.210303 0.214911 0.210249 0.328510 0.310610 0.270586 0.258623 0.230455 0.231210 0.251065 0.265643 0.257174 0.226971 0.229121 0.229411
chargesum: 0.00000
title: Mulliken charges with hydrogens summed into heavy atoms:
elementType: O O N N C C C C C C C C C C C C C C C C C C C C C
charge: -0.306820 -0.260595 -0.005185 -0.125024 0.013083 0.008889 0.027533 0.014815 0.033015 -0.060306 -0.060047 0.179702 0.314465 0.307085 -0.009404 -0.270899 0.343102 -0.157279 -0.138963 0.344939 -0.093100 -0.129235 0.019457 0.034891 -0.024121
polarizability: 4.24958634e+02 -6.93818500e+00 2.08526674e+02 -8.44487044e+00 1.17101490e+01 1.72200649e+02
1716.lowfreq: -1.3254 -0.0019 -0.0007 0.0018 2.4024 9.4061 12.3986 17.5914 26.5828
frequency: 9.1536 17.4998 26.5628 35.7763 42.2015 54.0104 58.3272 65.0981 72.8723 94.2280 105.3863 109.6168 137.1841 142.4466 149.3836 165.0043 174.4591 188.9436 202.9263 222.3847 238.7078 240.7221 268.3384 301.0567 312.6652 352.3511 359.6540 375.8475 411.4466 443.0055 447.9925 452.7896 474.6900 489.7614 528.1935 545.4555 556.6976 586.2137 607.7623 623.0700 644.8507 668.1383 689.4216 698.2799 721.0696 726.2156 730.3532 745.2617 761.8715 796.0034 800.2071 823.0983 834.4316 851.3030 882.7864 888.8264 890.7816 906.8758 926.0700 950.0004 968.0453 979.1898 983.1222 986.0102 986.1709 991.7251 993.9358 1002.6215 1019.6065 1036.3429 1043.6366 1061.0791 1075.1935 1077.5667 1084.1104 1102.2460 1126.9070 1148.1722 1150.5984 1167.6047 1169.2649 1172.5891 1191.5046 1193.9325 1202.7446 1210.0034 1217.1316 1236.4721 1250.1891 1278.7403 1281.3501 1287.5757 1289.4045 1295.2746 1296.4542 1308.4242 1320.0327 1346.4799 1357.5022 1369.9596 1383.5614 1386.5533 1389.1367 1397.7364 1416.9749 1442.1708 1451.5044 1461.6642 1463.0682 1463.7679 1466.9699 1470.9568 1471.9862 1478.3937 1480.0834 1482.0378 1487.8656 1493.9849 1496.6864 1519.5584 1592.7039 1598.8391 1608.1635 1621.4878 1628.6832 2810.2360 2831.3949 2949.9946 2952.0153 2955.8767 2956.6849 2962.0830 2967.8562 2972.3407 2979.9602 2989.4373 3004.8476 3025.8745 3027.7415 3045.3537 3069.4175 3070.8012 3091.4176 3129.9598 3139.4270 3147.8509 3156.2365 3164.8665 3167.2001 3174.3413 3195.5672 3429.2213 3534.3945
redmass: 5.3429 4.6898 5.5687 4.4134 2.8472 2.2050 2.9529 4.0363 3.9431 3.2136 3.1761 2.1267 2.3151 3.9214 2.9376 3.0438 2.5039 1.5080 3.7030 2.3812 3.7781 1.1433 4.1729 4.4465 5.8375 4.5096 4.6002 4.7459 2.9348 3.5875 3.0273 3.2037 3.7294 3.2177 4.7544 4.7205 4.0694 4.5221 5.2133 3.7866 1.2935 1.3634 3.1937 3.1661 4.9608 1.0671 3.7283 1.0978 1.6570 2.2637 1.6070 4.4378 1.2767 1.4069 1.3905 1.5585 1.4045 1.4217 4.7013 4.5289 1.3611 1.5753 1.3157 5.4141 1.3081 1.5509 1.6193 2.8491 2.0845 3.2972 1.5145 2.4692 2.3162 1.5039 2.1505 1.8298 2.6287 1.5316 1.7088 1.1459 2.7563 1.1851 1.9313 2.0012 2.0510 1.9986 1.8096 1.3364 1.3067 1.1336 1.3561 1.3324 1.1181 1.7242 1.4506 1.3510 1.4084 1.5109 1.6716 4.8751 1.8931 4.4665 1.2182 1.2879 3.4842 2.3161 1.4674 1.4782 1.0721 1.0853 1.0941 2.2362 1.0756 1.0426 1.0761 1.0451 1.0839 1.4986 1.0942 2.1851 6.3948 6.1956 7.1139 6.2539 4.3154 1.0711 1.0714 1.0840 1.0591 1.0597 1.0402 1.0653 1.0607 1.0363 1.0809 1.0968 1.1005 1.0979 1.1030 1.1031 1.1007 1.0993 1.0948 1.0849 1.0891 1.0918 1.0929 1.0962 1.0909 1.1003 1.0954 1.0741 1.0757
irintensity: 0.3442 0.3631 1.2057 0.4230 1.2733 0.1068 2.1972 0.7021 2.3610 0.3282 0.8818 2.0894 0.1066 0.0335 6.8869 2.9449 0.1045 1.7213 0.5867 0.9872 1.4441 0.0434 0.1243 4.7497 10.6916 18.8261 3.0454 1.0160 0.7123 3.7189 4.3643 9.5717 7.2019 12.6530 3.5605 12.1347 8.3728 5.7681 1.1161 2.9035 71.1496 67.2066 19.8290 15.6751 6.1921 13.0235 6.0396 0.2133 87.7032 15.1849 3.7986 14.3363 1.4424 44.3390 20.5989 2.1895 7.3726 3.9656 0.6418 87.7034 0.4409 3.6280 2.2681 1.3124 0.6175 0.0487 27.2126 0.0387 18.0395 1.4305 6.0777 11.6437 9.2129 12.0560 5.5062 4.1556 2.6803 3.0189 2.2473 42.1004 53.1107 55.0685 3.1545 51.2166 30.7870 246.8005 273.1834 9.3395 2.0701 1.2830 93.5593 6.2740 0.4617 0.5627 2.8497 0.8035 6.2074 3.5679 5.5115 101.8616 27.6316 25.1502 11.9020 26.2729 61.9937 17.6781 263.7719 17.0454 0.7193 6.3232 21.4462 203.8829 0.2282 12.3434 2.1949 14.2563 16.9489 134.5737 5.6276 499.9949 29.3670 12.2287 106.2066 7.6581 109.2692 86.4410 134.5053 55.3727 2.7170 3.1852 34.3957 2.6369 105.7406 38.8829 75.1848 2.7224 0.4838 19.8613 9.1337 113.0446 95.9265 56.0172 16.2714 2.5567 11.6598 11.1794 28.8309 14.1901 3.0350 9.4134 8.0697 20.2316 20.4615
temp: 298.150 k
press: 1.00000 atm
elementType: 8 8 7 7 6 6 6 6 6 6 6 6 6 6 6 6 6 6 6 6 6 6 6 6 6 1 1 1 1 1 1 1 1 1 1 1 1 1 1 1 1 1 1 1 1 1 1 1 1 1 1 1 1
symmnumber: 1
zpe: 1171990.9 jmol-1
zpe.correction: 0.446388 hartree
zpe.thermalcorrener: 0.472568 hartree
zpe.thermalcorrenthalpy: 0.473512 hartree
zpe.thermalcorrgfe: 0.385653 hartree
zpe.sumelectzpe: -1075.112606 hartree
zpe.sumelectthermal: -1075.086426 hartree
zpe.sumelectthermalent: -1075.085482 hartree
zpe.sumelectthermalfe: -1075.173342 hartree
dipole: -0.2110 4.5545 -0.6160
dipole: 4.6008
quadrupole: -136.7797 -146.5902 -151.4175
quadrupole: -5.0326 -6.0422 0.4774
quadrupole: 8.1494 -1.6611 -6.4883 -5.0326 -6.0422 0.4774
hfenergy: -1075.5589942 hartree
pointgroup: C01 [X(C21H28N2O2)]
dipole: -0.0859606 -1.7804105 0.3149934 debye
polarizability: 424.9420119|6.9776591|209.4015112|8.6949041|10.1962584|171.342433 unknown
InChI: InChI=1S/C21H28N2O2/c1-3-4-5-9-14-22-16-21(24)23-20-13-12-19(15-17(20)2)25-18-10-7-6-8-11-18/h6-8,10-13,15,22-23H,3-5,9,14,16H2,1-2H3
charge 0 multiplicity 1
53 atoms
O  -4.855773 1.223145 0.514697
O  1.765334 1.275479 0.375428
N  4.059632 -0.253465 0.015055
N  0.475714 -0.686483 0.560556
C  7.922356 -0.419678 0.150178
C  6.510477 0.015949 -0.300961
C  9.054543 0.296242 -0.620272
C  5.3872 -0.698534 0.474232
C  10.468239 -0.143927 -0.176061
C  2.923943 -0.855342 0.713171
C  11.594671 0.577227 -0.947513
C  1.672588 0.019046 0.519286
C  -0.862297 -0.191126 0.522506
C  -1.925543 -1.145072 0.609431
C  -1.152744 1.193895 0.409116
C  -3.258542 -0.681611 0.577359
C  -3.538418 0.698447 0.45412
C  -2.489577 1.635197 0.374418
C  -1.643305 -2.632901 0.74696
C  -5.942208 0.546786 -0.094817
C  -5.813475 -0.209059 -1.284233
C  -7.204674 0.747207 0.506944
C  -6.970294 -0.778606 -1.861989
C  -8.351436 0.175064 -0.08487
C  -8.240653 -0.594037 -1.267713
H  8.028062 -1.516926 0.016632
H  8.040639 -0.225255 1.236896
H  6.376713 -0.184367 -1.381719
H  6.405397 1.11361 -0.167196
H  8.954532 1.393621 -0.48495
H  8.93715 0.10579 -1.707497
H  5.534675 -0.534638 1.574712
H  5.470071 -1.79257 0.307947
H  10.567802 -1.240313 -0.313177
H  10.583237 0.044664 0.911087
H  3.956303 0.771564 -0.019484
H  2.741172 -1.88797 0.345475
H  3.087809 -0.939656 1.822003
H  11.535724 1.672581 -0.802529
H  12.594228 0.245241 -0.611158
H  11.520554 0.379476 -2.033643
H  0.568911 -1.701926 0.630745
H  -0.327108 1.904074 0.342124
H  -4.080462 -1.400164 0.661127
H  -2.7280 2.699147 0.289272
H  -1.077116 -3.032543 -0.118716
H  -1.067525 -2.865584 1.665534
H  -2.584009 -3.20376 0.804886
H  -4.834098 -0.336846 -1.75561
H  -7.266726 1.346741 1.420069
H  -6.876003 -1.360374 -2.785811
H  -9.331348 0.329222 0.380269
H  -9.132141 -1.037981 -1.723017
