program: Gaussian 09
title: 000043606
version: EM64L-G09RevD.01
frameworkgroup: C1[X(C8H16F2)]
method: RPBEPBE
basis: SDD
operation: Freq
keyword: #pfreq=noraman
keyword: PBEPBE/SDD
title: #p freq=noraman PBEPBE/SDD
converged: YES YES NO NO
title: Mulliken charges:
elementType: F F C C C C C C C C H H H H H H H H H H H H H H H H
charge: -0.206168 -0.204023 -0.365625 -0.370786 -0.387771 -0.352176 -0.431334 -0.355516 0.103743 -0.694918 0.191667 0.198939 0.189989 0.193917 0.229231 0.193353 0.188203 0.189425 0.245361 0.223220 0.196057 0.195103 0.193464 0.210369 0.216548 0.209726
chargesum: 0.00000
title: Mulliken charges with hydrogens summed into heavy atoms:
elementType: F F C C C C C C C C
charge: -0.206168 -0.204023 0.024982 0.013120 0.034812 0.025453 0.037247 0.035644 0.297207 -0.058275
polarizability: 1.11208426e+02 -1.49782353e+00 7.86954433e+01 6.24641374e-01 7.78018320e-01 7.44309428e+01
1716.lowfreq: -19.4683 -0.0012 -0.0009 0.0004 6.5482 17.7457 30.0167 46.2070 58.8849
frequency: 27.3431 45.9560 58.8320 82.7485 98.0181 135.9067 144.3979 149.3154 219.2546 228.5703 262.8402 383.3360 391.5520 466.7402 475.1491 531.2081 722.7402 732.8982 762.0290 812.0569 870.2901 888.2174 933.1581 950.3172 995.7359 1005.4231 1034.0614 1048.3130 1079.3325 1081.6908 1087.9206 1120.9280 1158.3015 1192.1302 1222.5246 1233.5241 1265.0714 1271.1722 1283.9978 1295.8034 1297.3605 1301.7460 1324.0440 1340.4310 1354.6551 1360.2880 1374.3414 1387.7072 1449.7523 1462.5362 1463.1690 1469.1805 1476.5293 1476.6505 1484.3889 1488.9285 2952.0108 2954.1250 2960.2315 2967.7975 2971.8441 2972.3900 2987.3370 2998.7348 3003.0561 3015.4475 3031.8115 3042.9340 3051.8748 3068.5707 3072.1974 3075.8269
redmass: 2.9866 2.6631 4.4348 2.8866 1.8727 2.3173 2.2362 3.0660 5.2473 1.1220 3.5817 3.2396 4.8436 4.4100 3.0898 3.6709 1.0625 1.0940 1.2066 1.5024 1.6988 1.9248 1.4725 5.4752 4.5767 1.2037 3.3577 3.3305 2.5743 2.2156 2.0576 2.5015 2.1202 1.6500 1.2702 1.3705 1.2597 1.2302 1.0323 1.1320 1.1154 1.2235 1.2277 1.3537 1.6100 1.5497 1.5911 1.2170 1.0937 1.0729 1.0692 1.0709 1.0772 1.0431 1.0859 1.0922 1.0587 1.0589 1.0594 1.0597 1.0625 1.0363 1.0966 1.0978 1.0618 1.1010 1.1021 1.1013 1.0925 1.1007 1.0993 1.1011
irintensity: 0.7743 1.1198 0.5658 1.1641 0.8056 0.2507 0.4034 1.9765 0.8128 0.0011 0.3775 0.1860 10.8178 1.6169 4.8997 11.3278 14.2521 0.3586 2.3045 14.0890 23.0805 1.1636 41.0875 105.6091 4.5092 5.4705 7.8715 7.2653 4.6211 5.9618 63.8193 14.4904 23.2362 3.2698 8.5779 2.8115 0.8866 0.9695 0.5389 0.4051 1.8464 0.6755 11.8599 8.0535 6.7652 6.2755 33.8724 11.9348 7.5595 0.2263 0.1672 1.4173 0.9871 12.4618 3.7143 28.4707 0.5343 0.3501 14.0185 52.9747 107.0740 34.6712 1.4422 0.9834 19.8955 1.2494 20.4715 91.9309 16.3759 88.3197 52.6929 78.5173
temp: 298.150 k
press: 1.00000 atm
elementType: 9 9 6 6 6 6 6 6 6 6 1 1 1 1 1 1 1 1 1 1 1 1 1 1 1 1
symmnumber: 1
zpe: 594464.5 jmol-1
zpe.correction: 0.226420 hartree
zpe.thermalcorrener: 0.239177 hartree
zpe.thermalcorrenthalpy: 0.240121 hartree
zpe.thermalcorrgfe: 0.185318 hartree
zpe.sumelectzpe: -513.300937 hartree
zpe.sumelectthermal: -513.288180 hartree
zpe.sumelectthermalent: -513.287236 hartree
zpe.sumelectthermalfe: -513.342039 hartree
dipole: -2.8360 -0.6359 1.4235
dipole: 3.2363
quadrupole: -80.1956 -64.4418 -60.1120
quadrupole: -1.3784 5.4038 0.6172
quadrupole: -11.9458 3.8080 8.1378 -1.3784 5.4038 0.6172
hfenergy: -513.5273568 hartree
pointgroup: C01 [X(C8H16F2)]
dipole: 1.1183802 0.2528934 0.5535854 debye
dipolederiv: -0.4321729 -0.1131145 -0.0359871 -0.0877651 -0.7039356 -0.1565394 -0.0353143 -0.2468473 -0.3833112 -0.88195 0.2533322 -0.0131738 0.2450618 -0.482423 0.0041923 -0.1126033 0.0637897 -0.2915187 -0.0211903 0.0202831 -0.0010031 0.021529 0.110054 0.0435997 -0.0003154 0.0426855 0.160527 -0.0600697 -0.0015182 0.0129166 -0.0100662 0.1083716 0.0345616 0.0168803 0.0359059 0.1671642 -0.0047362 -0.0090857 0.0226989 -0.0284059 0.0689116 0.0226986 0.0229811 0.025325 0.1666042 -0.0516966 0.0127797 0.0057021 0.0531161 0.0977983 0.043989 -0.0152561 0.0446674 0.1605422 -0.3120602 -0.0514385 0.0112344 -0.1367779 -0.01713 0.0286256 0.1168845 0.0639928 0.0500098 0.0252815 -0.0020185 0.0087986 -0.0481222 0.1183126 0.030535 0.0330581 0.0290907 0.1588695 1.3155634 -0.0734112 0.0125349 -0.0158286 1.1618397 0.1128701 0.0142414 0.1144571 0.770712 -0.0805733 -0.0319429 0.0261394 0.0010758 0.0643705 0.0172992 0.0090927 0.0186968 0.0852725 0.0333901 -0.0100025 -0.0002129 -0.0058997 -0.1510386 -0.0821601 0.000658 -0.1077986 0.0208736 0.037714 -0.0006183 -0.0023054 -0.0012291 0.0492157 0.0460647 -0.007232 0.0692801 -0.1725405 0.0380139 0.003539 0.0005964 0.0034514 0.0483579 0.0437882 0.0020833 0.0688971 -0.1842365 0.039179 -0.0157066 -0.0076055 -0.0145446 -0.1509148 -0.0785824 -0.0094535 -0.1032062 0.0229083 0.0621436 0.0034248 -0.0034 -0.0031319 -0.1024354 -0.0687552 -0.005381 -0.0877945 0.0378887 0.0434451 0.0085845 -0.0017796 0.0087094 0.0529023 0.0484973 0.0119404 0.0722888 -0.176088 0.0352992 -0.0055182 -0.0036143 -0.0155036 -0.1617168 -0.0811902 -0.0051733 -0.1063022 0.0229928 0.0364388 0.0055644 -0.0090868 -0.0008752 0.049318 0.0446521 0.0006972 0.0688922 -0.1864066 0.065444 -0.0066284 0.007222 0.0052748 0.0849747 0.0355363 -0.0229474 0.056021 -0.0991771 0.0718957 -0.0215748 -0.012997 0.0153482 -0.0768707 -0.0848171 0.0171465 -0.0973602 0.046017 0.0253116 -0.0467187 -0.0155997 -0.0117135 -0.1654547 -0.0812766 -0.0085052 -0.1092055 0.0318199 0.0281567 -0.005975 0.0303594 0.0056593 0.0566584 0.0446629 -0.0013342 0.0751934 -0.1956249 0.0029062 0.0038539 0.0162748 -0.0103073 -0.0106361 0.0501389 -0.0021041 0.0306325 -0.1461714 0.0777173 -0.0091813 -0.0239932 -0.0303767 0.0767816 0.038627 0.0420902 0.050768 -0.1816479 -0.1696079 0.0981021 -0.0368781 0.1316611 0.0120328 0.0386923 -0.0540279 0.0404404 0.0817638 0.0761569 -0.0050106 0.0131591 -0.0703395 -0.1373441 -0.0957098 -0.0081061 -0.11251 0.0327572 unknown
polarizability: 111.1982561|-1.5556826|78.6875108|-0.7609804|-0.8045753|74.4490455 unknown
InChI: InChI=1S/C8H16F2/c1-2-3-4-5-6-7-8(9)10/h8H,2-7H2,1H3
charge 0 multiplicity 1
26 atoms
F  -3.65335 -1.267295 -0.445316
F  -4.606631 0.782044 -0.001769
C  0.378318 0.4845 -0.110275
C  1.631185 -0.346927 0.244914
C  -0.940125 -0.2157 0.287142
C  2.954075 0.334909 -0.170815
C  -2.185122 0.630478 -0.064623
C  4.20767 -0.493721 0.191817
C  -3.48003 -0.056844 0.320832
C  5.525361 0.187936 -0.235589
H  0.439144 1.473415 0.390426
H  0.370515 0.687369 -1.201363
H  1.646659 -0.539892 1.338175
H  1.562356 -1.340565 -0.24497
H  -1.009162 -1.194559 -0.224932
H  -0.926325 -0.427479 1.37679
H  3.023097 1.332143 0.3125
H  2.943771 0.520681 -1.265357
H  -2.216104 0.84136 -1.149908
H  -2.150266 1.604275 0.460728
H  4.134417 -1.492093 -0.286174
H  4.220795 -0.674261 1.286239
H  -3.575415 -0.336503 1.386255
H  5.550751 0.349957 -1.329826
H  6.405167 -0.42409 0.035586
H  5.637449 1.175261 0.251211
