program: Gaussian 09
title: 000043633
version: EM64L-G09RevD.01
frameworkgroup: C1[X(C23H25NO6)]
method: RPBEPBE
basis: SDD
operation: Freq
keyword: #p
keyword: freq=noraman
keyword: PBEPBE/SDD
title: #p freq=noraman PBEPBE/SDD
converged: NO YES NO NO
title: Mulliken charges:
elementType: O O O O O O N C C C C C C C C C C C C C C C C C C C C C C C H H H H H H H H H H H H H H H H H H H H H H H H H
charge: -0.288695 -0.311852 -0.181145 -0.290716 -0.160284 -0.256071 -0.115135 -0.156788 0.063846 -0.681440 0.325509 -0.401067 -0.536411 0.195330 0.430438 0.091119 -0.642121 -0.427701 -0.401979 0.140468 -0.478767 -0.261695 0.265143 -0.379258 0.242579 0.226780 -0.345017 -0.369294 -0.487906 -0.494506 0.214228 0.251499 0.229104 0.194819 0.214782 0.209498 0.237582 0.226106 0.191483 0.227650 0.235616 0.279419 0.243325 0.226665 0.253007 0.214746 0.229739 0.272032 0.224689 0.217400 0.242080 0.208648 0.197243 0.239932 0.205344
chargesum: 0.00000
title: Mulliken charges with hydrogens summed into heavy atoms:
elementType: O O O O O O N C C C C C C C C C C C C C C C C C C C C C C C
charge: -0.288695 -0.311852 -0.181145 -0.290716 -0.160284 -0.256071 -0.115135 0.057440 0.063846 -0.200837 0.325509 0.008534 -0.089331 0.195330 0.430438 0.091119 0.003117 -0.192084 -0.122560 0.140468 -0.235441 -0.035030 0.265143 -0.126251 0.242579 0.226780 0.099468 0.127427 0.180222 0.148013
polarizability: 3.71035728e+02 8.41523964e+00 2.90251347e+02 4.01968215e+00 -1.96567379e+01 1.81481083e+02
1716.lowfreq: -20.4170 -7.1991 -0.8754 -0.0006 -0.0004 0.0001 3.0820 19.6070 24.5437
frequency: -20.2591 19.4690 24.4193 30.2504 35.9416 40.9373 56.9274 65.5292 67.5425 74.6533 80.6761 102.4920 115.7812 135.3635 144.6622 160.5129 173.7192 184.6337 194.5756 201.0538 221.4801 225.4960 232.1477 251.5866 276.2741 298.9330 309.6285 329.6224 345.2543 350.9439 357.1326 361.0390 379.9441 395.2980 409.3285 434.8073 449.5874 485.9675 492.0561 525.6912 527.4599 542.8794 547.3467 554.3096 582.4159 590.7965 609.0746 628.5636 647.8941 690.4703 703.2218 719.4451 744.3443 756.0050 769.3194 796.1341 802.8131 817.9202 828.6466 841.1904 863.6301 890.9982 896.0094 912.7801 922.7194 945.1580 957.1859 977.6396 983.0446 985.2314 992.3474 997.6663 1002.8242 1028.2657 1045.4751 1065.4720 1067.9694 1073.6841 1087.5583 1089.1356 1105.8921 1110.9855 1112.3477 1115.6262 1134.7184 1139.6435 1143.9302 1153.1342 1159.0484 1162.0883 1185.5495 1190.8073 1202.3930 1220.4654 1225.0915 1226.6279 1228.6626 1233.5524 1243.8136 1265.6772 1287.9823 1302.1913 1314.3229 1334.3354 1343.4174 1358.4681 1368.0445 1371.8815 1375.3891 1381.7163 1411.4174 1431.3949 1435.4648 1436.6290 1441.6472 1449.0771 1451.0513 1455.2332 1456.7400 1457.2653 1460.1676 1468.7070 1470.6827 1473.9990 1475.9482 1478.1436 1478.4401 1482.3061 1580.3544 1598.3597 1600.7783 1610.5207 1674.7307 1721.7332 2787.0750 2847.7768 2864.2343 2921.9769 2934.6485 2940.6346 2951.8561 2980.2468 2982.2578 2986.6049 2995.5469 3023.6367 3030.9531 3033.9954 3036.1165 3038.1995 3065.3164 3091.5081 3109.4869 3111.0998 3116.7053 3135.8343 3143.3623 3173.8521 3175.9555
redmass: 3.3076 6.0558 4.7204 4.0561 5.1418 4.3796 3.9494 4.2205 2.5807 3.5874 5.6641 5.3666 2.5046 4.2813 5.2341 1.6684 3.0849 4.1442 2.3015 1.4565 2.9254 2.6180 1.2069 5.4555 3.0477 3.2899 4.0783 4.4404 5.7911 3.5804 3.9093 4.3453 4.2039 4.0350 5.1009 3.1415 4.2170 3.1397 4.8020 4.0831 4.0587 4.9951 4.3275 4.7469 5.4219 3.4762 4.4556 4.7810 4.4797 5.2134 5.9422 5.5991 3.5880 3.3576 3.2542 3.9530 1.9434 2.2118 3.0241 2.8075 4.8062 5.9632 3.5619 3.9092 1.4413 1.6208 2.2736 3.0113 1.7394 1.8029 2.5413 2.0365 2.7487 2.2003 5.7720 2.7715 3.9254 2.6913 2.5505 2.6373 2.3476 1.3128 1.6206 1.2806 2.1793 2.1186 1.5435 1.3594 1.6015 1.3056 1.3714 1.6668 1.4983 1.1293 1.7421 1.5815 1.7229 1.7949 2.7371 1.7133 1.7283 2.1665 1.5882 1.7564 1.8029 1.3463 1.8456 4.5650 1.4666 2.7371 3.6180 1.1098 1.1896 1.1336 1.2597 1.4160 1.0955 1.6448 1.0634 1.0574 1.0573 1.1517 2.2466 1.0973 1.9232 1.0782 1.2634 1.2052 7.2273 7.1331 7.2568 8.1500 11.7262 11.7551 1.0782 1.0685 1.0598 1.0360 1.0542 1.0354 1.0574 1.0604 1.0645 1.1014 1.1030 1.1033 1.1023 1.0929 1.0764 1.0924 1.0957 1.0993 1.0968 1.0987 1.0874 1.0897 1.0939 1.0958 1.0953
irintensity: 8.5062 0.2317 0.9488 1.3877 1.5929 1.5798 1.7803 1.8527 9.3607 2.7609 2.2133 3.5523 5.0498 0.5785 0.2350 0.3573 1.5208 0.5294 1.2211 0.5545 0.7180 4.8686 7.6305 1.1643 8.4630 1.1143 4.8823 0.9963 0.2612 1.4709 4.2014 0.9176 1.5748 2.1652 1.6517 3.6633 1.6221 0.2614 3.8431 0.9752 18.3248 2.8397 0.7915 1.9510 10.8207 2.6526 7.8487 10.7050 5.1146 2.0607 2.4143 10.4298 19.0456 1.7721 21.2462 10.3096 26.3193 14.8688 87.9148 21.4687 63.6349 16.2294 10.9642 19.4860 4.0317 9.8317 12.6304 1.8109 34.0249 23.5374 38.4335 1.3854 13.0901 19.6436 545.0107 57.9656 183.4639 52.8637 28.6790 9.8571 36.2424 13.1130 32.2440 1.4080 82.4431 66.9736 10.1982 7.3709 5.2447 0.3797 1.5162 1.2555 7.0851 2.2429 13.8427 78.2924 119.1963 7.0903 23.8290 0.9279 19.3211 5.2805 5.4538 9.4309 10.8490 9.1965 5.1462 5.8133 11.6768 2.9386 38.4094 8.3418 1.9122 4.1164 17.0618 32.7130 22.7032 22.4134 11.0306 8.6345 15.2034 13.7842 31.3536 12.1716 11.1724 5.2302 20.2738 11.0993 15.6162 4.9696 2.0243 4.3914 127.2126 160.8400 42.3644 48.5943 173.6888 95.6643 34.1259 68.6795 39.9268 29.0960 17.1412 38.5435 60.7244 71.9913 17.9956 45.0377 20.7970 65.7689 30.2419 32.1742 29.8504 21.5317 9.2275 13.0964 27.8166 5.0072 8.1893
temp: 298.150 k
press: 1.00000 atm
elementType: 8 8 8 8 8 8 7 6 6 6 6 6 6 6 6 6 6 6 6 6 6 6 6 6 6 6 6 6 6 6 1 1 1 1 1 1 1 1 1 1 1 1 1 1 1 1 1 1 1 1 1 1 1 1 1
symmnumber: 1
zpe: 1142456.9 jmol-1
zpe.correction: 0.435139 hartree
zpe.thermalcorrener: 0.463239 hartree
zpe.thermalcorrenthalpy: 0.464183 hartree
zpe.thermalcorrgfe: 0.374371 hartree
zpe.sumelectzpe: -1395.289075 hartree
zpe.sumelectthermal: -1395.260975 hartree
zpe.sumelectthermalent: -1395.260031 hartree
zpe.sumelectthermalfe: -1395.349843 hartree
dipole: 0.4110 2.4011 2.3625
dipole: 3.3934
quadrupole: -137.7325 -148.1229 -191.6684
quadrupole: -11.8241 -8.5981 -4.2451
quadrupole: 21.4421 11.0517 -32.4938 -11.8241 -8.5981 -4.2451
hfenergy: -1395.724214 hartree
pointgroup: C01 [X(C23H25N1O6)]
dipole: -0.3051849 -1.0907497 0.706802 debye
polarizability: 371.7935123|-3.2486918|276.3738035|3.1762748|40.4462228|194.6008421 unknown
InChI: InChI=1S/C23H25NO6/c1-24-10-9-14-5-4-6-16-21(14)17(24)11-15-7-8-18(29-19(25)12-27-2)23(22(15)16)30-20(26)13-28-3/h4-8,17H,9-13H2,1-3H3
charge 0 multiplicity 1
55 atoms
O  1.253812 -0.79066 -0.052943
O  2.924641 1.233647 0.792054
O  0.778974 -1.354311 2.178172
O  3.407334 -2.585907 0.38722
O  3.489517 0.897454 -1.475187
O  6.07122 0.109511 -0.651436
N  -4.92418 1.372025 0.429579
C  -3.457758 1.130767 0.464148
C  -3.040643 -0.081822 -0.375813
C  -2.655636 2.350037 -0.056831
C  -3.987342 -0.999858 -0.891185
C  -5.687533 0.110118 0.603162
C  -5.467911 -0.803657 -0.610271
C  -1.647143 -0.255394 -0.651386
C  -1.1682 2.088098 0.102776
C  -0.686861 0.7632 -0.144927
C  -5.35341 2.395607 1.406859
C  -3.545456 -2.090711 -1.68007
C  -1.231084 -1.343181 -1.46397
C  0.686541 0.514606 0.0975
C  -0.28109 3.106282 0.510933
C  -2.176745 -2.257145 -1.972406
C  1.56888 1.543807 0.491605
C  1.09601 2.85011 0.688606
C  1.294162 -1.629983 1.082617
C  3.787151 0.813721 -0.281187
C  2.024676 -2.920193 0.728614
C  5.046335 0.271824 0.367351
C  4.078605 -3.65188 -0.363059
C  7.294629 -0.457593 -0.086366
H  -3.125779 0.94029 1.523279
H  -2.927702 2.507501 -1.120001
H  -2.925465 3.267646 0.492591
H  -5.391636 -0.425626 1.542064
H  -6.758788 0.366333 0.694027
H  -5.957434 -1.782531 -0.443363
H  -5.952695 -0.341273 -1.492263
H  -4.891378 3.371153 1.183265
H  -5.100906 2.126041 2.463834
H  -6.44756 2.524703 1.337192
H  -4.284018 -2.800484 -2.072984
H  -0.174522 -1.449905 -1.721283
H  -0.670169 4.114055 0.693004
H  -1.845787 -3.089405 -2.603444
H  1.795236 3.632816 0.995468
H  1.508453 -3.391565 -0.135779
H  1.978951 -3.59931 1.601902
H  4.770527 -0.700562 0.832484
H  5.365663 0.968613 1.171961
H  3.530012 -3.885751 -1.298193
H  5.074112 -3.256632 -0.6178
H  4.184929 -4.574745 0.244192
H  7.113556 -1.458673 0.362575
H  7.999927 -0.553097 -0.926089
H  7.734478 0.204291 0.690401
