program: Gaussian 09
title: 000043808
version: EM64L-G09RevD.01
frameworkgroup: C1[X(C19H19NO3)]
method: RPBEPBE
basis: SDD
operation: Freq
keyword: #p
keyword: freq=noraman
keyword: PBEPBE/SDD
title: #p freq=noraman PBEPBE/SDD
converged: NO NO NO NO
title: Mulliken charges:
elementType: O O O N C C C C C C C C C C C C C C C C C C C H H H H H H H H H H H H H H H H H H H
charge: -0.304829 -0.450960 -0.260625 -0.215725 0.315692 -0.288083 0.115300 0.240829 0.011109 0.393803 -0.365683 -0.358397 -0.608509 0.107003 -0.264274 -0.221508 -0.382991 -0.431390 -0.206536 -0.227875 -0.222545 -0.688059 -0.248407 0.261497 0.271270 0.231775 0.221779 0.254150 0.247573 0.226252 0.223776 0.240485 0.274298 0.202093 0.195325 0.220860 0.220997 0.204807 0.227821 0.227762 0.223635 0.386506
chargesum: 0.00000
title: Mulliken charges with hydrogens summed into heavy atoms:
elementType: O O O N C C C C C C C C C C C C C C C C C C C
charge: -0.304829 -0.064454 -0.260625 -0.215725 0.315692 -0.026586 0.115300 0.240829 0.011109 0.393803 -0.094413 -0.126622 0.114993 0.107003 -0.038021 0.002269 -0.142506 -0.157093 0.190881 -0.007015 -0.001549 -0.027670 -0.024772
polarizability: 2.44651475e+02 1.30349310e+01 2.60208550e+02 1.60240359e+00 -1.47706531e+01 1.77196812e+02
1716.lowfreq: -8.2131 -5.7273 -0.0004 -0.0003 0.0000 2.5497 4.5977 25.4049 39.8324
frequency: -2.0209 25.2875 39.7755 44.8180 50.1233 66.0858 71.4802 80.5909 87.0972 132.2533 153.4553 163.3017 172.9342 207.5071 240.6730 264.8533 272.8710 284.6043 317.4421 323.6319 339.6599 370.9302 380.9890 401.7230 435.5568 466.9743 512.9520 538.2840 552.3480 560.5661 580.5201 602.3832 609.7924 616.3973 655.3621 663.7156 701.1923 714.2487 729.1279 756.3320 765.6264 766.8989 800.8113 816.1322 837.9768 841.0329 854.0493 856.9578 882.4306 931.2367 945.8816 978.8420 980.2707 988.8277 990.4771 996.0941 1012.4312 1013.6798 1027.0864 1029.2054 1054.6391 1081.0522 1110.2378 1114.6661 1119.6875 1135.1788 1140.4304 1158.1117 1168.8500 1181.6006 1185.9009 1198.2705 1243.7239 1253.2221 1257.5305 1287.7928 1301.3836 1324.4256 1348.9764 1365.9052 1375.2389 1384.5889 1390.8085 1395.3764 1416.2794 1433.9199 1435.6094 1460.0903 1467.0039 1471.0800 1478.5584 1479.0146 1480.4327 1490.1573 1492.1999 1518.6464 1572.8293 1593.2520 1612.2834 1619.5194 1625.7043 2936.2675 2975.3560 2987.6106 2990.9756 3007.8052 3088.1386 3096.6603 3100.4099 3118.5961 3127.6588 3129.3230 3130.7838 3141.1102 3145.2288 3156.3185 3160.1047 3171.5751 3179.6310 3516.2785
redmass: 4.1209 4.6798 5.7502 2.2783 2.8699 3.8129 2.3072 1.5485 3.9128 3.2757 4.4506 4.5570 5.7519 3.1447 1.4908 4.2607 4.7382 4.0928 3.0587 4.3779 7.1946 6.2613 6.3308 2.8483 2.9389 3.6506 4.3216 4.5025 2.5468 4.7289 3.0191 2.6844 3.8342 6.2081 4.5109 4.5897 2.5281 2.2431 4.7771 1.5309 2.5063 4.0292 4.2954 1.1090 2.8971 4.2341 1.3090 1.6216 2.9145 1.5953 1.3810 1.3760 1.3486 4.2919 4.8638 1.3975 2.7257 4.0451 2.3315 2.9575 3.9255 1.6300 1.7004 2.1673 1.3424 1.4773 1.4656 1.6234 1.0675 1.3163 1.3156 2.3032 1.9363 1.5235 1.3547 1.3572 1.6363 1.2745 2.0844 2.6647 1.5647 5.7700 3.5869 1.3594 6.9024 2.0373 1.8866 1.0411 1.2010 1.4351 1.4738 1.2808 1.8815 1.7805 1.0997 7.3829 6.6361 6.3488 6.0415 7.4144 7.1982 1.0556 1.0831 1.1056 1.0360 1.0366 1.0989 1.1011 1.0983 1.0844 1.0884 1.0893 1.0976 1.0940 1.0903 1.0985 1.0968 1.0962 1.0972 1.0639
irintensity: 0.0194 0.0841 1.3504 0.0530 0.1683 0.6744 1.9932 0.1103 1.0101 2.2689 3.6296 5.2719 0.5158 0.6239 0.8662 1.7088 0.2746 2.9304 0.1938 3.2105 7.3297 6.5167 2.4709 0.0443 3.8487 2.1331 2.8781 18.5520 47.4339 27.8722 23.0570 34.9575 19.4636 1.2568 23.2052 18.7784 15.8097 84.9024 30.7236 80.1558 21.8453 2.4943 1.1732 3.2577 4.8613 24.6053 1.7907 0.2706 9.0522 5.9103 1.1473 0.6770 0.5108 24.9990 12.3510 6.5710 94.8013 62.9449 63.6547 254.1096 144.7995 9.2940 16.0102 3.3531 9.0483 5.1209 5.7416 47.4299 1.7663 11.6875 7.1520 1.3288 3.0428 7.1390 4.3323 25.9433 17.8474 5.7236 3.3407 95.8604 29.4558 2.5338 54.6488 37.7502 30.1186 17.8856 7.7350 10.2440 19.9824 55.1544 3.3868 19.8558 12.3019 1.0343 1.3507 106.6724 0.9337 1.7730 8.5893 148.6804 280.8302 47.9841 16.0113 37.8092 26.2207 51.7874 32.4000 36.9695 18.1949 1.1612 8.5552 4.9014 4.1657 33.2389 15.5510 32.1458 29.3340 9.2706 11.0328 66.9434
temp: 298.150 k
press: 1.00000 atm
elementType: 8 8 8 7 6 6 6 6 6 6 6 6 6 6 6 6 6 6 6 6 6 6 6 1 1 1 1 1 1 1 1 1 1 1 1 1 1 1 1 1 1 1
symmnumber: 1
zpe: 878584.1 jmol-1
zpe.correction: 0.334635 hartree
zpe.thermalcorrener: 0.355260 hartree
zpe.thermalcorrenthalpy: 0.356205 hartree
zpe.thermalcorrgfe: 0.283863 hartree
zpe.sumelectzpe: -1014.205774 hartree
zpe.sumelectthermal: -1014.185149 hartree
zpe.sumelectthermalent: -1014.184204 hartree
zpe.sumelectthermalfe: -1014.256546 hartree
dipole: -4.0690 -0.0383 -0.3104
dipole: 4.0810
quadrupole: -121.7364 -125.3851 -128.9488
quadrupole: 9.0333 0.7114 1.9292
quadrupole: 3.6203 -0.0283 -3.5920 9.0333 0.7114 1.9292
hfenergy: -1014.540409 hartree
pointgroup: C01 [X(C19H19N1O3)]
dipole: -1.5734258 -0.1353932 0.289688 debye
polarizability: 242.6249946|-6.3066649|247.0297129|-16.2989402|33.3379448|192.4021304 unknown
InChI: InChI=1S/C19H19NO3/c1-3-23-18(13-9-5-4-6-10-13)16-14-11-7-8-12-15(14)20(2)17(16)19(21)22/h4-12,18,21H,3H2,1-2H3
charge 0 multiplicity 1
42 atoms
O  1.034981 0.524911 -2.066852
O  -2.650738 2.897056 1.527465
O  -0.443837 3.206009 0.893639
N  -2.460836 0.077219 0.990097
C  -0.434961 0.344544 -0.10006
C  0.853362 0.92706 -0.662352
C  -0.867834 -1.018196 -0.261296
C  -2.127736 -1.156153 0.4249
C  -1.430782 1.001703 0.663753
C  2.084264 0.453308 0.126548
C  -0.296663 -2.1429 -0.922667
C  -2.820171 -2.392785 0.462656
C  -3.661277 0.316952 1.805779
C  -1.421316 2.417566 1.021349
C  -0.980027 -3.367052 -0.878466
C  -2.230491 -3.487611 -0.19309
C  2.18084 0.765319 1.506118
C  3.132492 -0.261467 -0.497531
C  0.074409 1.17239 -2.978952
C  3.308875 0.36262 2.252696
C  4.260695 -0.669201 0.253409
C  0.403757 0.702112 -4.394684
C  4.353877 -0.360514 1.62897
H  0.800497 2.033089 -0.594133
H  0.652506 -2.035011 -1.454044
H  -3.7843 -2.506749 0.968217
H  -4.058247 -0.655287 2.135501
H  -3.412868 0.918721 2.691864
H  -4.437712 0.855483 1.235261
H  -0.558009 -4.246994 -1.375737
H  -2.743885 -4.455875 -0.183798
H  1.375164 1.326643 1.99353
H  3.060072 -0.480056 -1.566262
H  -0.961614 0.889037 -2.695826
H  0.170978 2.276439 -2.887488
H  3.375084 0.613229 3.317769
H  5.067369 -1.22494 -0.238991
H  -0.2768 1.177513 -5.124755
H  1.442103 0.96685 -4.660327
H  0.292513 -0.393269 -4.475699
H  5.229366 -0.674948 2.208708
H  -2.531999 3.865638 1.724781
