program: Gaussian 16
title: Title Card Required
version: ES64L-G16RevB.01
frameworkgroup: C1[X(C8H7NO2)]
method: RwB97XD
basis: 6-31+G(d,p)
operation: Freq
keyword: #N
keyword: Geom=AllCheck
keyword: Guess=TCheck
keyword: SCRF=Check
keyword: GenChk
keyword: RwB97XD/6-31+G(d,p)
keyword: Freq
converged: YES YES YES YES
title: Mulliken charges:
elementType: C C C C C C H H H H H C H C H N O O
charge: -0.183968 -0.258497 -0.174032 -0.323888 -0.159567 0.204067 0.186252 0.194863 0.194637 0.195527 0.195751 -0.231607 0.216113 0.085719 0.223435 -0.101314 -0.053146 -0.210345
chargesum: -0.00000
title: Mulliken charges with hydrogens summed into heavy atoms:
elementType: C C C C C C C C N O O
charge: 0.002284 -0.063634 0.020605 -0.128361 0.036184 0.204067 -0.015493 0.309154 -0.101314 -0.053146 -0.210345
chargesum: 0.00000
1716.lowfreq: -0.0009 -0.0008 -0.0005 5.3727 14.0405 18.3611 52.3110 88.4372 115.9774
frequency: 51.4594 88.4032 115.9771 147.0793 261.6468 283.2184 352.6345 415.9032 499.4752 552.6150 615.1090 635.7116 699.9986 732.8447 761.8679 791.7138 873.9238 878.1272 881.6268 964.7903 1014.2185 1019.9185 1022.0362 1024.4780 1036.7125 1065.4079 1122.9376 1187.3906 1215.3702 1242.7131 1310.2665 1334.8401 1365.2358 1377.2116 1424.4665 1497.5124 1548.6736 1614.3496 1656.2815 1683.4637 1720.7704 3212.2195 3217.5147 3218.1974 3225.1667 3232.9606 3240.1443 3292.9672
redmass: 7.3086 5.7134 5.9427 2.9298 8.6521 3.3099 6.3556 2.8519 2.9468 5.8175 6.8725 6.3984 2.4715 2.1043 8.6370 2.3519 1.2515 1.7725 4.5384 1.3401 1.3448 6.3439 1.3049 6.0102 1.3122 2.1481 1.5622 1.1016 1.1347 1.6838 1.6998 1.6967 3.0592 1.4217 11.5559 2.3303 2.3213 11.6810 5.5486 5.7471 5.5368 1.0884 1.0888 1.0906 1.0921 1.0961 1.0997 1.0964
irintensity: 0.0125 1.2633 3.7378 2.8084 0.5673 3.2702 1.3540 0.0004 18.2547 5.4476 34.8784 0.2739 40.7895 43.6811 14.8583 78.5201 0.4740 33.5061 2.9636 0.0504 15.3184 98.7263 38.2816 48.0506 1.5090 12.5449 18.4253 1.2947 35.0622 79.0067 77.6877 0.6834 34.7171 17.2317 1129.0766 28.2213 16.3087 446.7330 34.2706 32.4929 395.4860 2.4254 0.2860 0.8946 7.6540 23.2097 15.4732 15.0104
temp: 298.150 k
press: 1.00000 atm
elementType: 6 6 6 6 6 6 1 1 1 1 1 6 1 6 1 7 8 8
symmnumber: 1
zpe: 363231.4 jmol-1
zpe.correction: 0.138348 hartree
zpe.thermalcorrener: 0.147324 hartree
zpe.thermalcorrenthalpy: 0.148268 hartree
zpe.thermalcorrgfe: 0.103001 hartree
zpe.sumelectzpe: -513.884570 hartree
zpe.sumelectthermal: -513.875594 hartree
zpe.sumelectthermalent: -513.874649 hartree
zpe.sumelectthermalfe: -513.919917 hartree
dipole: 7.4225 -0.5664 -0.0001
dipole: 7.4441
quadrupole: -79.7370 -57.1930 -66.8086
quadrupole: 1.2077 -0.0002 -0.0005
quadrupole: -11.8241 10.7199 1.1043 1.2077 -0.0002 -0.0005
hfenergy: -514.0229175 hartree
pointgroup: C01 [X(C8H7N1O2)]
dipole: -0.0041445 -2.7436632 -1.0245489 debye
dipolederiv: -0.0514122 0.2375477 0.0923999 -0.1092675 0.1329845 0.0932951 -0.0370868 0.109641 -0.0914286 0.0054043 0.2273019 0.0937189 0.1997058 -0.2968065 -0.0330253 0.0834226 -0.031742 -0.1911398 0.1301002 -0.0705676 -0.013493 0.0166349 0.0071385 0.0570285 0.0190608 0.0529289 -0.1228255 -0.0298397 -0.229482 -0.0784051 -0.2132665 -0.1471819 0.0039957 -0.0723631 0.0032533 -0.1868827 0.0468137 -0.2151493 -0.0712315 0.1466211 0.1450971 0.1158264 0.063826 0.0987976 -0.1067998 0.0389741 -0.1954198 -0.0696281 0.019278 -0.7866987 -0.2808946 0.0105272 -0.2910353 -0.1400602 -0.010352 0.077674 0.0201123 0.0913388 0.0713159 -0.0358597 0.0252458 -0.0365136 0.1663971 -0.0553695 -0.0918933 -0.0456211 -0.0635257 0.0724338 -0.0451934 -0.0350269 -0.0465333 0.1664659 0.1115502 -0.0112933 -0.0074775 -0.0114612 -0.0733102 -0.0954851 -0.0075403 -0.0954828 0.144981 -0.0317313 0.1079264 0.0300365 0.0909714 0.0441499 -0.0489601 0.0237078 -0.0481665 0.1698535 -0.0317378 -0.0612822 -0.0330174 -0.0897852 0.0844237 -0.041414 -0.0436502 -0.0400757 0.1670307 0.1920194 -0.5290655 -0.1878262 -0.1967522 1.7260021 0.640266 -0.0637417 0.6246126 0.2163715 0.0541714 -0.0471637 -0.023568 -0.0181078 0.1087808 -0.0277479 -0.0127297 -0.0290747 0.1693718 0.0067197 0.6206335 0.2402393 0.2153671 -1.8241519 -0.605766 0.0889208 -0.5866779 -0.38926 0.094184 -0.0638334 -0.0305655 0.0159068 0.075994 -0.0594251 -0.000817 -0.0631772 0.2135273 2.0866318 0.2527245 0.1781543 -0.5176548 3.065285 1.0051994 -0.1094515 1.0414792 0.6912527 -1.2247954 0.5956572 0.1801995 0.7009302 -1.401133 -0.3671642 0.2195231 -0.3721357 -0.4578467 -1.3313308 -0.6043151 -0.2740271 -0.2769332 -1.004323 -0.2746758 -0.1518268 -0.2900979 -0.4190082 unknown
polarizability: 160.6166376|-21.2266807|232.7620225|-3.8901401|57.9723111|96.2696904 unknown
InChI: InChI=1S/C8H7NO2/c10-9(11)7-6-8-4-2-1-3-5-8/h1-7H
charge 0 multiplicity 1
18 atoms
C  5.12268224 -11.86571141 -0.52050885
C  5.02589062 -13.16212577 -1.00909992
C  6.17965265 -13.91647655 -1.23656293
C  7.43322429 -13.36839675 -0.97305032
C  7.53302678 -12.06927129 -0.48329831
C  6.38141578 -11.3024348 -0.25109007
H  4.21689091 -11.29284582 -0.34915707
H  4.04882649 -13.58818443 -1.21407178
H  6.09796766 -14.92945216 -1.61862226
H  8.33242991 -13.9505357 -1.14818058
H  8.5101022 -11.64093018 -0.277489
C  6.55297185 -9.94462153 0.26389391
H  7.57600702 -9.61785368 0.4341178
C  5.5717699 -9.07777025 0.5413046
H  4.50711686 -9.23029506 0.43421643
N  5.88618821 -7.76555862 1.04602849
O  4.93077876 -7.0254296 1.27736902
O  7.05526152 -7.43466078 1.22465693
