program: Orca
programVersion: 5.0.3
elementType: O O C C C C C C C C C C C C C C C C C C C C C H H H H H H H H H H H H H H H H H H H H H H H H H H H H H H Ag
elementType: Ag
charge: 1
multiplicity: 1
keywords: DLPNO-CCSD(T) def2-TZVPP def2-TZVPP/C VeryTightSCF
formula: C21H30O2Ag
InChI: InChI=1S/C21H30O2.Ag/c1-5-6-7-8-15-12-18(22)20-16-11-14(2)9-10-17(16)21(3,4)23-19(20)13-15;/h11-13,16-17,22H,5-10H2,1-4H3;
54 atoms
O  -0.45154 2.704565 -0.568184
O  0.32642 -0.684104 2.696909
C  -2.197085 1.102447 -0.370612
C  -1.600634 0.475393 0.890708
C  -1.887251 2.599781 -0.427676
C  -3.644709 0.665823 -0.529633
C  -0.13238 0.855386 0.96004
C  -3.679275 -0.834254 -0.813321
C  -1.828692 -1.025341 0.866317
C  -2.757473 -1.629744 0.076323
C  0.348774 1.921317 0.178509
C  -2.321628 3.376131 0.808988
C  -2.43137 3.246098 -1.689291
C  0.801559 0.219911 1.793193
C  1.708582 2.206598 0.104735
C  -3.059621 -3.094735 0.191657
C  2.625569 1.455882 0.819213
C  2.157553 0.487505 1.701996
C  4.103305 1.610006 0.581359
C  4.567542 0.953556 -0.733767
C  4.117583 -0.503303 -0.916796
C  2.797115 -0.633052 -1.68012
C  2.144387 -2.002501 -1.527486
H  -1.648494 0.689016 -1.232261
H  -2.127352 0.862633 1.770743
H  -4.20637 0.88485 0.382278
H  -4.136065 1.197601 -1.342842
H  -4.687801 -1.231797 -0.678671
H  -3.432264 -1.034715 -1.860611
H  -1.3796 -1.608152 1.665299
H  -2.117018 4.43629 0.667916
H  -1.791001 3.052283 1.703833
H  -3.39231 3.257236 0.980458
H  -1.984804 4.231656 -1.811066
H  -3.511736 3.370608 -1.630799
H  -2.190633 2.651578 -2.571428
H  2.027226 3.004531 -0.553459
H  -3.127971 -3.565289 -0.790278
H  -2.325658 -3.628563 0.793489
H  -4.037918 -3.215636 0.662282
H  2.8536 -0.060826 2.327491
H  4.649738 1.161477 1.413346
H  4.370874 2.667655 0.560903
H  4.214464 1.549018 -1.580267
H  5.656264 1.009122 -0.760873
H  1.03201 -0.947166 3.289722
H  4.02366 -0.98165 0.063665
H  4.888113 -1.06414 -1.449788
H  2.101475 0.135021 -1.33766
H  2.969151 -0.431536 -2.739587
H  2.758707 -2.828086 -1.889441
H  1.223676 -2.080168 -2.148035
H  1.9779 -2.237061 -0.459019
Ag -0.159032 -1.627855 -0.577777
totalener: -1108.70781207 hartree
nucrepener: 2552.96702051 hartree
electener: -3661.67483258 hartree
oneelecener: -6628.44473136 hartree
twoeener: 2966.76989878 hartree
kineticenergy: 1018.74031002 hartree
chargesum: 1.0000000
charge: -0.388002 -0.411208 -0.117650 0.247032 0.533813 -0.203992 -0.326590 -0.086960 -0.340123 0.033755 0.414598 -0.325839 -0.248808 0.202855 -0.348066 -0.205517 0.152845 -0.220538 -0.152360 -0.119191 -0.105681 -0.072852 -0.099905 0.052963 0.106513 0.080823 0.101150 0.107102 0.077721 0.219497 0.102328 0.081079 0.081943 0.098483 0.069107 0.075543 0.108673 0.088209 0.074638 0.109471 0.080694 0.079517 0.099807 0.062358 0.090092 0.229643 0.044678 0.097388 -0.006007 0.085905 0.110809 0.012628 0.020460 0.545167
charge: 0.272922 0.327074 -0.050114 -0.047614 -0.205310 0.021188 -0.078778 0.013046 -0.021599 -0.021477 -0.161805 0.046944 0.040967 -0.158226 -0.009468 0.044587 -0.048460 -0.042334 0.009985 0.002915 -0.008531 -0.016093 0.047013 0.041725 0.042643 0.026470 0.024862 0.035705 0.030431 0.028724 0.022976 0.014468 0.017666 0.022551 0.015801 0.014560 0.026767 0.024438 0.021810 0.031160 0.014521 0.025220 0.028662 0.017974 0.018947 -0.101624 0.013884 0.017651 0.015760 0.021305 0.029975 0.028142 0.028829 0.441165
qa: -0.3880 -0.4112 -0.1177 0.2470 0.5338 -0.2040 -0.3266 -0.0870 -0.3401 0.0338 0.4146 -0.3258 -0.2488 0.2029 -0.3481 -0.2055 0.1528 -0.2205 -0.1524 -0.1192 -0.1057 -0.0729 -0.0999 0.0530 0.1065 0.0808 0.1011 0.1071 0.0777 0.2195 0.1023 0.0811 0.0819 0.0985 0.0691 0.0755 0.1087 0.0882 0.0746 0.1095 0.0807 0.0795 0.0998 0.0624 0.0901 0.2296 0.0447 0.0974 -0.0060 0.0859 0.1108 0.0126 0.0205 0.5452
va: 1.9892 2.0159 3.9914 3.7034 3.5045 3.9270 3.4752 3.9010 3.7295 3.5719 3.9568 4.0139 3.9346 3.7937 3.9991 3.9753 3.6921 3.9049 3.8699 3.8893 3.8631 3.9050 3.9933 1.0341 0.9985 1.0194 1.0113 1.0133 1.0229 1.0136 1.0090 0.9948 1.0064 1.0142 1.0052 1.0057 1.0255 1.0006 1.0065 1.0018 1.0219 1.0129 1.0101 1.0144 1.0120 1.0151 1.0167 1.0092 1.0237 1.0204 0.9976 1.0224 1.0138 0.9231
e0: -1108.707812014 hartree
corrType: DLPNO BASED
energy: -1113.642799640388
dipole: 7.20114 -7.66694 -0.46580 116.34176 -118.17027 -1.82850 27.10314 -27.40075 -0.29762
magnitude: 1.91023 au
magnitude: 4.85542 debye
